{"text_format":"1","workbook":"xlsx","n_sheets":5,"sheets":["Notice","Listes de choix","Consignes Organisationnelles et","Evaluation de la mission","Synthèse de l'évaluation"],"not_rendered":{"charts":0,"images":0,"macros":1,"external_links":0,"defined_names":10,"comments":0,"pivot_tables":0},"unopened":[],"bounds":{"document_bytes":16777216,"sheet_cells":100000,"rows_first":2000,"rows_last":500,"rows_between":2000,"halvings":0,"cell_chars":16384,"cell_head_chars":4096},"cells_cut":0,"cells_raw":0,"read":"whole","date_system":"1900"}

{"sheet":"Notice","index":0,"n_rows":22,"n_cols":5,"rows_kept":22,"cut":false,"hidden":false,"merged":[[2,4,10,4],[15,2,15,4]]}
[]
[null,"CODE COULEURS DU TABLEAU",null,null,"Notice d'utilisation : "]
[null,null,null,null,"Sur la feuille \"Evaluation des risques\", il faut saisir préalablement le type de cavité la plus contraignante que se soit pour la progression ou pour la zone de travail.  Il faut ensuite saisir les différents intervenants de la missions et leur niveau de qualification,le lieu et dates de la mission. Saisir ensuite les facteurs risques et les facteurs agravants ainsi que les obligations par le chef de mission. Finaliser la saisie en cliquant sur le bouton \"Valider  cette estimation\".  Passer en suite sur la feuille de résultats qui synthétise vos réponses et exporter cette feuille de synthèse : \"Ficher/Exporter/\"."]
[]
[null,"Validité"]
[]
[null,"Non","Pas de formation réalisée"]
[]
[null,"Plus","Formation plus valide, en attente de renouvellement"]
[]
[null,"Oui","Formation valide"]
[]
[]
[]
[]
[null,null,"Cavités"]
[null,null,"Classe"]
[null,null,0,null,"Cavité aménagée pour le tourisme 5 ou laboratoire de recherche souterrain horizontal équipé d’éclairage ;"]
[null,null,1,null,"Cavité ou portion de cavité ne nécessitant pas de matériel autre qu’un casque avec éclairage "]
[null,null,2,null,"Cavité ou portion de cavité d’initiation ou de découverte. Les obstacles sont ponctuels. Leur franchissement, nécessitant éventuellement du matériel, est adapté aux possibilités du débutant. La présence d'eau ne doit pas empêcher la progression du groupe"]
[null,null,3,null,"Cavités ou portion de cavité dont les obstacles peuvent s'enchaîner. L'ensemble des verticales ne doit pas excéder quelques dizaines de mètres, de préférence en plusieurs tronçons."]
[null,null,4,null,"Toutes les autres cavités."]

{"sheet":"Listes de choix","index":1,"n_rows":58,"n_cols":6,"rows_kept":58,"cut":false,"hidden":false,"merged":[]}
["Non","Pas de formation réalisée"]
["Plus","Formation plus valide à renouveler"]
["Oui","Formation valide"]
["-"]
[]
[]
[]
["Non","Non"]
["Oui","Oui"]
[]
[]
[{"$f":"TODAY()","v":"2025-11-26"}]
[]
[]
["Participants à la mission"]
["Colonne1","Colonne2"]
["Chef des Opérations Souterraines","COS"]
["Opérateur Souterrain","OS"]
[]
[null,null,null,null,"Facteurs agravants"]
[null,null,null,null,"Distance au véhicule"]
[null,null,null,null,"Colonne1","Colonne2"]
[null,null,null,null,"Moins de 50 m",1]
["Niveaux de qualification",null,null,null,"Entre 50 à 200m ",2]
[null,null,null,null,"Entre 200 et 500m",3]
["Colonne1","Colonne2",null,null,"Entre 500 et 1 km",4]
["Sans compétence",0,null,null,"Plus d'1 km",5]
["Reconnu 0, 1 et 2 ",1,null,null,"Conditions de portage"]
["Reconnu 0, 1, 2 et 3",1,null,null,"Colonne1","Colonne2"]
["Reconnu 0, 1, 2, 3 et 4",1,null,null,"Pas de portage",1]
["Diplomé Classe 0, 1 et 2 ",10,null,null,"Léger et peu encombrant",2]
["Diplomé Classe 0, 1, 2 et 3",10,null,null,"Léger et emcombrant",3]
["Diplomé Classe 0, 1, 2, 3 et 4",10,null,null,"Lourd et peu encombrant",4]
[null,null,null,null,"Lourd et encombrant",5]
[null,null,null,null,"Type de Cavité"]
[null,null,null,null,"Colonne1","Colonne2"]
[null,null,null,null,0,1]
[null,null,null,null,1,2]
[null,null,null,null,2,3]
[null,null,null,null,3,4]
[null,null,null,null,4,5]
[null,null,null,null,"Situation d'encadrement"]
[null,null,null,null,"Colonne1","Colonne2"]
[null,null,null,null,"Sans encadrement",1]
[null,null,null,null,"Avec encadrement",2]
[]
[]
[null,null,null,null,"Case à cocher"]
[null,null,null,null,"Colonne1","Colonne2"]
[null,null,null,null,"Sans objet",1]
[null,null,null,null,"Oui",1]
[null,null,null,null,"Non ",0]
[]
[]
[null,null,null,null,"Case à cocher"]
[null,null,null,null,"Colonne1","Colonne2"]
[null,null,null,null,"Oui",1]
[null,null,null,null,"Non ",0]

{"sheet":"Consignes Organisationnelles et","index":2,"n_rows":38,"n_cols":20,"rows_kept":38,"cut":false,"hidden":false,"merged":[]}
[]
[null,null,null,null,null,null,null,null,null,null,null,null,null,null,null,null,null,null,null,"Conditions de la mission"]
["Cavité","Consignes Organisationnelle"]
[0,"Ordre de mission. Travail isolé interdit, toutefois, un agent peut, exceptionnellement, aller seul dans une cavité de classe 0 ou 1, sous réserve d’avoir pris les dispositions nécessaires à sa sécurité. Pour ce faire, il doit avoir informé le DU, l’AP et le responsable des activités souterraines de la localisation précise du site, de la cavité ou portion de cavité, des procédures d’alerte, des heures d’entrée et de sortie prévues, et de sa sortie effective."]
[1,"Ordre de mission. Travail isolé interdit, toutefois, un agent peut, exceptionnellement, aller seul dans une cavité de classe 0 ou 1, sous réserve d’avoir pris les dispositions nécessaires à sa sécurité. Pour ce faire, il doit avoir informé le DU, l’AP et le responsable des activités souterraines de la localisation précise du site, de la cavité ou portion de cavité, des procédures d’alerte, des heures d’entrée et de sortie prévues, et de sa sortie effective. + Minimum une personne compétente avec compétences techniques adaptées au terrain."]
[2,"Ordre de mission. Travail isolé interdit.  A minima une personne compétente en spéléologie, assurant la fonction de responsable de l’opération souterraine pour encadrer un groupe de 8 personnes maximum (soit 9 personnes au maximum) , A minima SST ou PSC1 idéalement SST milieu isolé, procédure d’alerte. Pour le chef de l’opération souterraines :  diplôme d’Etat (DEJEPS mention spéléologie) ou brevet fédéral en cours de validité délivré par la FFS (initiateur, moniteur ou instructeur) et formation aux premiers secours (SST ou PSC1 à jour)."]
[3,"Ordre de mission. Travail isolé interdit. 2 personnes minimum compétentes en spéléologie pour encadrer un groupe de 8 personnes maximum (soit des groupes de 10 maximum). Une des deux assure la fonction de chef de l’opération souterraine.  A minima SST ou PSC1 idéalement SST milieu isolé, procédure d’alerte. Pour le chef de l’opération souterraines :  diplôme d’Etat (DEJEPS mention spéléologie) ou brevet fédéral en cours de validité délivré par la FFS (initiateur, moniteur ou instructeur) et formation aux premiers secours (SST ou PSC1 à jour)."]
[4,"Ordre de mission. Travail isolé interdit. 2 personnes minimum compétentes en spéléologie pour encadrer un groupe de 8 personnes maximum (soit des groupes de 10 maximum). Une des deux assure la fonction de chef de l’opération souterraine.  A minima SST ou PSC1 idéalement SST milieu isolé, procédure d’alerte. Pour le chef de l’opération souterraines :  diplôme d’Etat (DEJEPS mention spéléologie) ou brevet fédéral en cours de validité délivré par la FFS (initiateur, moniteur ou instructeur) et formation aux premiers secours (SST ou PSC1 à jour)."]
[]
[]
["Cavité","Consignes techniques","Colonne1"]
[0,"Trousse de secours"]
[1,"Trousse de secours + Casque et son éclairage et doublement de l’éclairage en cas de travail isolé."]
[2,"Trousse de secours + Casque et son éclairage et doublement de l’éclairage en cas de travail isolé. + Combinaison spéléo, casque avec éclairage et batteries de rechanges et bottes "]
[3,"Trousse de secours + Casque et son éclairage et doublement de l’éclairage en cas de travail isolé. + Combinaison spéléo, casque avec éclairage et batteries de rechanges et bottes  = Equipements de progression verticale"]
[4,"Trousse de secours + Casque et son éclairage et doublement de l’éclairage en cas de travail isolé. + Combinaison spéléo, casque avec éclairage et batteries de rechanges et bottes  = Equipements de progression verticale"]
[]
[]
[]
[]
[]
[null,null,null,null,null,null,null,null,null,null,null,null,null,null,null,null,{"$f":"VBAProject.Module2.MaCondition(Q6,R10)","v":"Conditions non valides"}]
[]
[]
[]
[]
[]
[]
[]
[]
[]
[]
[]
[]
[]
[]
[]
[null,"Cote"]

{"sheet":"Evaluation de la mission","index":3,"n_rows":1805,"n_cols":42,"rows_kept":1805,"cut":false,"hidden":false,"merged":[[19,29,21,36],[17,30,17,33],[14,33,14,37],[15,34,15,36],[4,18,5,24],[8,33,8,37],[9,34,9,36],[32,1,32,9],[10,18,11,19],[10,20,11,24],[16,21,17,24],[16,18,17,20],[18,18,18,19],[19,18,19,19],[20,18,20,19],[26,29,26,32],[14,1,16,9],[23,5,25,9],[0,15,0,16],[1,1,1,9],[0,11,0,13],[12,29,12,32],[0,18,0,24],[0,0,0,9],[1,18,1,24],[0,29,0,41],[0,26,0,27],[1,29,1,33],[1,34,1,37],[1,38,1,39],[1,40,1,41]]}
["Description de la mission",null,null,null,null,null,null,null,null,null,null,"PERMIS",null,null,null,"SST",null,null,"Critères d'évaluation des risques avant mission",null,null,null,null,null,null,null,"Facteurs Aggravants",null,null,"Obligations du chef de mission (le chef de mission valide ou pas les obligations)"]
[null,null,null,null,null,null,null,null,null,null,null,null,null,null,null,null,null,null,"Evaluation des risques",null,null,null,null,null,null,null,"Distance au véhicule","Conditions de portage",null,"Obligations du chef de mission avant le départ de la mission ",null,null,null,null,"Obligations du chef de mission durant la mission",null,null,null,"Intervention de personnels extérieurs au labo",null,"Incidents / Accidents"]
["Type de Cavité la plus contraignante dans le déplacement ou le travail","Niveau de responsabilité","Nom  Prénom","Niveau de qualification","Date de saisie","Date début de mission","Date fin de mission","Nature de la mission","Type d'encadrement","Lieu de la mission",null,"B","C","E(B)",null,"SST","SST Milieux hostiles",null,null,null,null,null,null,null,null,null,"Plus d'1 km","Lourd et encombrant",null,"Une information spécifique à la mission a été dispensée. : consignes chaque jour avant le départ de mission (place et mission de chacun…)","Vérification du bon état du matériel et des EPI des participants.","Check de la compatibilité de la fatigue des personnelles avec la mission chaque jour.","Vérification des bulletins météorologique et hydrologique","Trousse de secours terrain.","Il s’engage à vérifier le matériel durant la mission et à modifier celui-ci ou la mission si besoin.","S’assure en permanence de la sécurité","S’engage à arrêter la mission, à revenir à la surface, à changer d'itinéraire, ou à mettre en place une procèdure d'urgence. Il a seule autorité pour cela.","S’engage en cas d’accident à mettre en attente de la victime, à déclencher l’alerte au spéléo-secours concerné et la procèdure d'assistance. Il alerte sans délai le DU, l'AP, le responsable des activité souterraines. Il établi un rapport circonstancié auprès du DU au retour de la mission.\nIl établit un rapport circonstancié auprès du DU au retour de la mission.","Travail en commun : une convention a été signée","Travaux en co-activité : un plan de prévention a-t-il été signé?","Les membres du groupe sont SST.","Pour les missions hors UE: S assurer de moyen de sauvetage mobilisable."]
[]
[4,"Chef des Opérations Souterraines","toto","Diplomé Classe 0, 1, 2, 3 et 4","2025-10-23","2025-10-29","2025-10-30","carottage  spéléothème","Avec encadrement","moye",null,"Oui","Non","Non",null,"Oui","Non",null,"Risques naturels",null,null,null,null,null,null,null,"DV","CP"]
[null,"Chef des Opérations Souterraines","tutu","Diplomé Classe 0, 1, 2, 3 et 4",null,null,null,null,null,null,null,"Non",null,null,null,null,null,null,null,null,null,null,null,null,null,null,{"$f":"VLOOKUP(AA3,Tableau6[],2,FALSE)","v":5},{"$f":"VLOOKUP(AB3,Tableau7[],2,FALSE)","v":5},null,"Oui","Oui","Oui","Oui","Oui","Sans objet","Oui","Oui","Oui","Sans objet","Oui","Oui","Oui"]
[null,"Chef des Opérations Souterraines","titi","Reconnu 0, 1, 2, 3 et 4",null,null,null,null,null,null,null,null,"Oui","Plus",null,null,null,null,"Risque de crue","Rochers instables","Animaux vénimeux","Risque de zoonose (chauve souris)","Champignons (inhalation moisissures)"," Risque de leptospiroses (eaux souillées)","Autres",null,null,null,null,{"$f":"VLOOKUP(AD6,Tableau13[],2,FALSE)","v":1},{"$f":"VLOOKUP(AE6,Tableau13[],2,FALSE)","v":1},{"$f":"VLOOKUP(AF6,Tableau13[],2,FALSE)","v":1},{"$f":"VLOOKUP(AG6,Tableau13[],2,FALSE)","v":1},{"$f":"VLOOKUP(AH6,Tableau13[],2,FALSE)","v":1},{"$f":"VLOOKUP(AI6,Tableau13[],2,FALSE)","v":1},{"$f":"VLOOKUP(AJ6,Tableau13[],2,FALSE)","v":1},{"$f":"VLOOKUP(AK6,Tableau13[],2,FALSE)","v":1},{"$f":"VLOOKUP(AL6,Tableau13[],2,FALSE)","v":1},{"$f":"VLOOKUP(AM6,Tableau13[],2,FALSE)","v":1},{"$f":"VLOOKUP(AN6,Tableau13[],2,FALSE)","v":1},{"$f":"VLOOKUP(AO6,Tableau13[],2,FALSE)","v":1},{"$f":"VLOOKUP(AP6,Tableau13[],2,FALSE)","v":1}]
[null,"Opérateur Souterrain","tata","Reconnu 0, 1 et 2 ",null,null,null,null,null,null,null,null,null,null,null,null,null,null,"Oui","Oui","Oui","Oui","Oui","Oui","Oui"]
[null,null,null,null,null,null,null,null,null,null,null,null,null,null,null,null,null,null,{"$f":"VLOOKUP(S8,Tableau1311[],2,FALSE)","v":1},{"$f":"VLOOKUP(T8,Tableau1311[],2,FALSE)","v":1},{"$f":"VLOOKUP(U8,Tableau1311[],2,FALSE)","v":1},{"$f":"VLOOKUP(V8,Tableau1311[],2,FALSE)","v":1},{"$f":"VLOOKUP(W8,Tableau1311[],2,FALSE)","v":1},{"$f":"VLOOKUP(X8,Tableau1311[],2,FALSE)","v":1},{"$f":"VLOOKUP(Y8,Tableau1311[],2,FALSE)","v":1},null,null,null,null,"Niveau risque cavité",{"$f":"VLOOKUP(A5,Tableau8[],2,FALSE)","v":5},null,null,"Niveau de risque avant application des obligations du chef de mission"]
[null,null,null,null,null,null,null,null,null,null,null,null,null,null,null,null,null,null,null,null,null,null,null,null,null,null,null,null,null,"Encadrement",{"$f":"VLOOKUP(I5,Tableau9[],2,FALSE)","v":2},null,null,null,{"$f":"PRODUCT(AE9,AE10,AE11)/2","v":100}]
[null,null,null,null,null,null,null,null,null,null,null,null,null,null,null,null,null,null,"Travail en hauteur",null,"Conditions de travail",null,null,null,null,null,null,null,null,"Critères",{"$f":"SUM(S9,T9,U9,V9,W9,X9,Y9,S15,T15,U15,V15,W15,X15,Y15,S21,U21,V21,W21,X21,Y21)","v":20}]
[]
[null,null,null,null,null,null,null,null,null,null,null,null,null,null,null,null,null,null,"Risque de chute","Risque chute d'objets","Bruit","Empoussièrement","Température","Activités aquatiques longues","Embruns"]
[null,null,null,null,null,null,null,null,null,null,null,null,null,null,null,null,null,null,"Oui","Oui","Oui","Oui","Oui","Oui","Oui"]
[null,"Le chef des opérations souterraines (responsable technique de la mission) est la personne qui sur le terrain, prend la responsabilité d'engager les hommes et le matériel. Il construit sa décision en fonction de l'état de fatigue du groupe et l'évoluation des conditions météorologiques.",null,null,null,null,null,null,null,null,null,null,null,null,null,null,null,null,{"$f":"VLOOKUP(S14,Tableau1311[],2,FALSE)","v":1},{"$f":"VLOOKUP(T14,Tableau1311[],2,FALSE)","v":1},{"$f":"VLOOKUP(U14,Tableau1311[],2,FALSE)","v":1},{"$f":"VLOOKUP(V14,Tableau1311[],2,FALSE)","v":1},{"$f":"VLOOKUP(W14,Tableau1311[],2,FALSE)","v":1},{"$f":"VLOOKUP(X14,Tableau1311[],2,FALSE)","v":1},{"$f":"VLOOKUP(Y14,Tableau1311[],2,FALSE)","v":1},null,null,null,null,null,null,null,null,"Niveau de risque après application des obligations du chef de mission"]
[null,null,null,null,null,null,null,null,null,null,null,null,null,null,null,null,null,null,null,null,null,null,null,null,null,null,null,null,null,null,null,null,null,null,{"$f":"AI10-SUM(AP7,AO7,AN7,AM7,AL7,AK7,AJ7,AI7,AH7,AG7,AF7,AE7,AD7)*2","v":74}]
[null,null,null,null,null,null,null,null,null,null,null,null,null,null,null,null,null,null,"Conditions spécifiques",null,null,"Port et déplacement de charge"]
[null,null,null,null,null,null,null,null,null,null,null,null,null,null,null,null,null,null,null,null,null,null,null,null,null,null,null,null,null,null,"Remarques sur la mission :"]
[null,null,null,null,null,null,null,null,null,null,null,null,null,null,null,null,null,null,"Présence de gaz ( CO2, CO, CH4, H2S, Radon, autres)",null,"risque d'anoxie","Port de charge >5 kg par personne","Distance de portage >50m","Descente et remontée de matériel en parois","Obstacle à franchir"]
[null,null,null,null,null,null,null,null,null,null,null,null,null,null,null,null,null,null,"Oui",null,"Oui","Oui","Oui","Oui","Oui",null,null,null,null,"2 Personnes minimum- 10 maximun. Un COS obligatoire et diplômé pour une cavité de type 3 ou4, un OS compétent obligatoire."]
[null,null,null,null,null,null,null,null,null,null,null,null,null,null,null,null,null,null,{"$f":"VLOOKUP(S20,Tableau1311[],2,FALSE)","v":1},null,{"$f":"VLOOKUP(U20,Tableau1311[],2,FALSE)","v":1},{"$f":"VLOOKUP(V20,Tableau1311[],2,FALSE)","v":1},{"$f":"VLOOKUP(W20,Tableau1311[],2,FALSE)","v":1},{"$f":"VLOOKUP(X20,Tableau1311[],2,FALSE)","v":1},{"$f":"VLOOKUP(Y20,Tableau1311[],2,FALSE)","v":1}]
[]
[]
[]
[]
[]
[]
[]
[]
[]
[]
[]
[]
[]
[]
[]
[]
[]
[]
[]
[]
[]
[]
[]
[]
[]
[]
[]
[]
[]
[]
[]
[]
[]
[]
[]
[]
[]
[]
[]
[]
[]
[]
[]
[]
[]
[]
[]
[]
[]
[]
[]
[]
[]
[]
[]
[]
[]
[]
[]
[]
[]
[]
[]
[]
[]
[]
[]
[]
[]
[]
[]
[]
[]
[]
[]
[]
[]
[]
[]
[]
[]
[]
[]
[]
[]
[]
[]
[]
[]
[]
[]
[]
[]
[]
[]
[]
[]
[]
[]
[]
[]
[]
[]
[]
[]
[]
[]
[]
[]
[]
[]
[]
[]
[]
[]
[]
[]
[]
[]
[]
[]
[]
[]
[]
[]
[]
[]
[]
[]
[]
[]
[]
[]
[]
[]
[]
[]
[]
[]
[]
[]
[]
[]
[]
[]
[]
[]
[]
[]
[]
[]
[]
[]
[]
[]
[]
[]
[]
[]
[]
[]
[]
[]
[]
[]
[]
[]
[]
[]
[]
[]
[]
[]
[]
[]
[]
[]
[]
[]
{"$rows_left_out":1606}
{"sheet":"Synthèse de l'évaluation","index":4,"n_rows":88,"n_cols":7,"rows_kept":88,"cut":false,"hidden":false,"merged":[[82,5,82,6],[83,5,83,6],[86,5,86,6],[87,5,87,6],[82,0,82,3],[83,0,83,3],[85,0,85,3],[86,0,86,3],[87,0,87,3],[74,5,74,6],[74,0,75,3],[76,0,79,3],[76,5,76,6],[81,0,81,3],[71,0,72,3],[71,5,71,6],[73,0,73,3],[70,5,70,6],[66,0,66,3],[73,5,73,6],[67,5,67,6],[70,0,70,3],[67,0,67,3],[68,0,68,3],[65,5,65,6],[66,5,66,6],[68,5,68,6],[61,5,61,6],[63,5,63,6],[65,0,65,3],[19,5,19,6],[20,5,20,6],[21,5,21,6],[57,0,57,6],[55,2,55,6],[23,2,23,6],[62,0,62,3],[63,0,64,3],[0,4,0,6],[1,4,1,6],[51,2,51,6],[53,0,53,6],[37,0,37,1],[37,2,37,6],[39,0,39,1],[39,2,39,6],[12,5,12,6],[13,5,13,6],[14,5,14,6],[15,5,15,6],[16,5,16,6],[17,5,17,6],[18,5,18,6]]}
[null,null,null,null,"Date de saisie"]
[null,"Milieux souterrains",null,null,"2025-10-24T10:31:16"]
[]
[null,"Organisation de la mission"]
["Lieu de la mission",{"$f":"'Evaluation de la mission'!J5","v":"moye"}]
["Nature de la mission",{"$f":"'Evaluation de la mission'!H5","v":"carottage  spéléothème"}]
["Date début de la mission",{"$f":"'Evaluation de la mission'!F7","v":"00:00:00"}]
["Date fin de la mission",{"$f":"'Evaluation de la mission'!G5","v":"2025-10-30"}]
[]
["Cavité de type:",{"$f":"'Evaluation de la mission'!A5","v":4}]
[null,"Composition de l'équipe"]
[]
[{"$f":"'Evaluation de la mission'!C5:C14","v":"toto"},{"$f":"'Evaluation de la mission'!D5:D14","v":"Diplomé Classe 0, 1, 2, 3 et 4"},null,null,null,{"$f":"VLOOKUP('Evaluation de la mission'!B5,Tableau2[],2,FALSE)","v":"COS"}]
["tutu","Diplomé Classe 0, 1, 2, 3 et 4",null,null,null,{"$f":"VLOOKUP('Evaluation de la mission'!B6,Tableau2[],2,FALSE)","v":"COS"}]
["titi","Reconnu 0, 1, 2, 3 et 4",null,null,null,{"$f":"VLOOKUP('Evaluation de la mission'!B7,Tableau2[],2,FALSE)","v":"COS"}]
["tata","Reconnu 0, 1 et 2 ",null,null,null,{"$f":"VLOOKUP('Evaluation de la mission'!B8,Tableau2[],2,FALSE)","v":"OS"}]
[0,0,null,null,null,{"$f":"VLOOKUP('Evaluation de la mission'!B9,Tableau2[],2,FALSE)","v":{"$error":"#N/A"}}]
[0,0,null,null,null,{"$f":"VLOOKUP('Evaluation de la mission'!B10,Tableau2[],2,FALSE)","v":{"$error":"#N/A"}}]
[0,0,null,null,null,{"$f":"VLOOKUP('Evaluation de la mission'!B11,Tableau2[],2,FALSE)","v":{"$error":"#N/A"}}]
[0,0,null,null,null,{"$f":"VLOOKUP('Evaluation de la mission'!B12,Tableau2[],2,FALSE)","v":{"$error":"#N/A"}}]
[0,0,null,null,null,{"$f":"VLOOKUP('Evaluation de la mission'!B13,Tableau2[],2,FALSE)","v":{"$error":"#N/A"}}]
[0,0,null,null,null,{"$f":"VLOOKUP('Evaluation de la mission'!B14,Tableau2[],2,FALSE)","v":{"$error":"#N/A"}}]
[]
[null,null,"Permis / formations"]
[null,null,"B","C","E(B)","SST","SST milieux isolés"]
["Responsable mission",{"$f":"'Evaluation de la mission'!C5","v":"toto"},{"$f":"'Evaluation de la mission'!L5:N14","v":"Oui"},"Non","Non",{"$f":"'Evaluation de la mission'!P5:Q14","v":"Oui"},"Non"]
[{"$f":"'Evaluation de la mission'!B6:C14","v":"Chef des Opérations Souterraines"},"tutu","Non",0,0,0,0]
["Chef des Opérations Souterraines","titi",0,"Oui","Plus",0,0]
["Opérateur Souterrain","tata",0,0,0,0,0]
[0,0,0,0,0,0,0]
[0,0,0,0,0,0,0]
[0,0,0,0,0,0,0]
[0,0,0,0,0,0,0]
[0,0,0,0,0,0,0]
[0,0,0,0,0,0,0]
[]
[]
["Niveau de risque avant application des obligations du chef de mission (0 à 100)",null,{"$f":"'Evaluation de la mission'!AI10","v":100}]
[]
["Niveau de risque après application des obligations du chef de mission (0 à 100)",null,{"$f":"'Evaluation de la mission'!AI16","v":74}]
[]
[]
[]
[]
[]
[]
[]
[]
[]
[]
[]
[null,"Consignes organisationnelles"]
[]
[{"$f":"VLOOKUP('Evaluation de la mission'!A5,'Consignes Organisationnelles et'!A4:B8,2,FALSE)","v":"Ordre de mission. Travail isolé interdit. 2 personnes minimum compétentes en spéléologie pour encadrer un groupe de 8 personnes maximum (soit des groupes de 10 maximum). Une des deux assure la fonction de chef de l’opération souterraine.  A minima SST ou PSC1 idéalement SST milieu isolé, procédure d’alerte. Pour le chef de l’opération souterraines :  diplôme d’Etat (DEJEPS mention spéléologie) ou brevet fédéral en cours de validité délivré par la FFS (initiateur, moniteur ou instructeur) et formation aux premiers secours (SST ou PSC1 à jour)."}]
[]
[null,"Consignes Techniques"]
[]
[{"$f":"VLOOKUP('Evaluation de la mission'!A5,'Consignes Organisationnelles et'!A12:B16,2,FALSE)","v":"Trousse de secours + Casque et son éclairage et doublement de l’éclairage en cas de travail isolé. + Combinaison spéléo, casque avec éclairage et batteries de rechanges et bottes  = Equipements de progression verticale"}]
[]
[null,"Obligations du Chef de mission"]
[]
[null,null,null,null,null,"Résultats"]
["Obligations du chef de mission avant le départ de la mission"]
[{"$f":"'Evaluation de la mission'!AD3","v":"Une information spécifique à la mission a été dispensée. : consignes chaque jour avant le départ de mission (place et mission de chacun…)"},null,null,null,null,{"$f":"'Evaluation de la mission'!AD6","v":"Oui"}]
[]
[{"$f":"'Evaluation de la mission'!AE3","v":"Vérification du bon état du matériel et des EPI des participants."},null,null,null,null,{"$f":"'Evaluation de la mission'!AE6","v":"Oui"}]
[{"$f":"'Evaluation de la mission'!AF3","v":"Check de la compatibilité de la fatigue des personnelles avec la mission chaque jour."},null,null,null,null,{"$f":"'Evaluation de la mission'!AF6","v":"Oui"}]
[{"$f":"'Evaluation de la mission'!AG3","v":"Vérification des bulletins météorologique et hydrologique"},null,null,null,null,{"$f":"'Evaluation de la mission'!AG6","v":"Oui"}]
[{"$f":"'Evaluation de la mission'!AH3","v":"Trousse de secours terrain."},null,null,null,null,{"$f":"'Evaluation de la mission'!AH6","v":"Oui"}]
[]
["Obligations du chef de mission durant la mission"]
[{"$f":"'Evaluation de la mission'!AI3","v":"Il s’engage à vérifier le matériel durant la mission et à modifier celui-ci ou la mission si besoin."},null,null,null,null,{"$f":"'Evaluation de la mission'!AI6","v":"Sans objet"}]
[]
[{"$f":"'Evaluation de la mission'!AJ3","v":"S’assure en permanence de la sécurité"},null,null,null,null,{"$f":"'Evaluation de la mission'!AJ6","v":"Oui"}]
["S’engage à arrêter la mission, à revenir dans un lieu sécurisé, ou à mettre en place une procédure d’urgence. Il a la seule autorité pour ces choix.",null,null,null,null,{"$f":"'Evaluation de la mission'!AK6","v":"Oui"}]
[]
[{"$f":"'Evaluation de la mission'!AL3","v":"S’engage en cas d’accident à mettre en attente de la victime, à déclencher l’alerte au spéléo-secours concerné et la procèdure d'assistance. Il alerte sans délai le DU, l'AP, le responsable des activité souterraines. Il établi un rapport circonstancié auprès du DU au retour de la mission.\nIl établit un rapport circonstancié auprès du DU au retour de la mission."},null,null,null,null,{"$f":"'Evaluation de la mission'!AL6","v":"Oui"}]
[]
[]
[]
[]
["Intervention de personnels extérieurs au labo"]
[{"$f":"'Evaluation de la mission'!AM3","v":"Travail en commun : une convention a été signée"},null,null,null,null,{"$f":"'Evaluation de la mission'!AM6","v":"Sans objet"}]
[{"$f":"'Evaluation de la mission'!AN3","v":"Travaux en co-activité : un plan de prévention a-t-il été signé?"},null,null,null,null,{"$f":"'Evaluation de la mission'!AN6","v":"Oui"}]
[]
["Incidents / Accidents"]
[{"$f":"'Evaluation de la mission'!AO3","v":"Les membres du groupe sont SST."},null,null,null,null,{"$f":"'Evaluation de la mission'!AO6","v":"Oui"}]
[{"$f":"'Evaluation de la mission'!AP3","v":"Pour les missions hors UE: S assurer de moyen de sauvetage mobilisable."},null,null,null,null,{"$f":"'Evaluation de la mission'!AP6","v":"Oui"}]