{"text_format":"1","workbook":"xlsx","n_sheets":5,"sheets":["Notice","Selection list","Organistion and technical instr","Mission assessment","Assessment summary"],"not_rendered":{"charts":0,"images":0,"macros":1,"external_links":0,"defined_names":10,"comments":0,"pivot_tables":0},"unopened":[],"bounds":{"document_bytes":16777216,"sheet_cells":100000,"rows_first":2000,"rows_last":500,"rows_between":2000,"halvings":0,"cell_chars":16384,"cell_head_chars":4096},"cells_cut":0,"cells_raw":0,"read":"whole","date_system":"1900"}

{"sheet":"Notice","index":0,"n_rows":16,"n_cols":5,"rows_kept":16,"cut":false,"hidden":false,"merged":[[2,4,10,4],[15,2,15,4]]}
[]
[null,"Table color code",null,null,"User Manual"]
[null,null,null,null,"On the ‘Mission Assessment’ sheet, you must first enter the name of the mission leader and then the various participants in the mission, the location and dates of the mission, and the skills of the participants. Next, enter the risk factors and aggravating factors, as well as the obligations of the mission leader. Next, go to the results sheet, which summarises your answers, and export this summary sheet: ‘File/Export/’."]
[]
[null,"Validity"]
[]
[null,"No","No training complete"]
[]
[null,"No longer valide","Unvalid training"]
[]
[null,"Yes","Valid Training"]
[]
[]
[]
[]
[null,null,"Special Conditions"]

{"sheet":"Selection list","index":1,"n_rows":58,"n_cols":6,"rows_kept":58,"cut":false,"hidden":false,"merged":[]}
["No","No training complete"]
["No longer valid","Unvalid training"]
["Yes","Valid Training"]
["-"]
[]
[]
[]
["No"]
["Yes"]
[]
[]
[{"$f":"TODAY()","v":"2025-12-03"}]
[]
[]
["Mission participants"]
["Qualified operator"]
["Unqualified operator"]
["Scientific mission manager"]
["Others"]
["Risk factors",null,null,null,"Aggravating factors"]
["Colonne1","Colonne2",null,null,"Vehicule distance"]
["Maximum slope used (PM)",null,null,null,"Colonne1","Colonne2"]
["Slope less than 14%",1,null,null,"Less than 50 m",1]
["Slope between 15 and 34%",2,null,null,"Between 50 and 200 m",1]
["Slope between 35 and 54%",3,null,null,"Between 200 and 500 m",1]
["Slope between 55 and 83%",4,null,null,"Between 500 m and 1 km",3]
["Slope greater than 84%",5,null,null,"More than 1 km",4]
["Nature of the terrain (NT), Most challenging type of terrain",null,null,null,"Carrying conditions"]
["Colonne1","Colonne2",null,null,"Colonne1","Colonne2"]
["Parking",1,null,null,"No carrying required",1]
["Path",2,null,null,"Lightweight and compact",1]
["Off-path",3,null,null,"Lightweight and bulky",1]
["Rockfall",4,null,null,"Heavy and compact",3]
["Rock face / Glacier",5,null,null,"Heavy and bulky",5]
["Progression or working conditions (CPT)"]
["Colonne1","Colonne2"]
["Dry",1]
["Damp",2]
["Soggy",3]
["Snowy",4]
["Icy",5]
[]
[]
[]
[]
[]
[]
[null,null,null,null,"Case à cocher"]
[null,null,null,null,"Colonne1","Colonne2"]
[null,null,null,null,"Not applicable",1]
[null,null,null,null,"Yes",1]
[null,null,null,null,"No",0]
[]
[]
[null,null,null,null,"Case à cocher"]
[null,null,null,null,"Colonne1","Colonne2"]
[null,null,null,null,"Yes",1]
[null,null,null,null,"No",0]

{"sheet":"Organistion and technical instr","index":2,"n_rows":38,"n_cols":20,"rows_kept":38,"cut":false,"hidden":false,"merged":[]}
[]
[null,null,null,null,null,null,null,null,null,null,null,null,null,null,null,null,null,null,null,"Conditions de la mission"]
["Côte","Organisational Instructions"]
[1,"Mission order."]
[2,"Mission order. + Need to organise the mission / Appropriate means of communication for calling for help if necessary / Specific training on the environment / Compulsory health and safety training for participants. "]
[3,"Mission order. + Need to organise the mission / Appropriate means of communication for calling for help if necessary / Specific training on the environment / Compulsory health and safety training for participants. + Advance preparation for the mission: recommendations by the mission leader. Two people must be present for the entire mission, means of communication between team members.\nField bell"]
[4,"Mission order. + Need to organise the mission / Appropriate means of communication for calling for help if necessary / Specific training on the environment / Compulsory health and safety training for participants. + Advance preparation for the mission: recommendations by the mission leader. Two people must be present for the entire mission, means of communication between team members. + Equipment validation by the mission leader, consideration of load issues for carrying equipment, checks by the mission leader\nField bell"]
[5,"Mission order. + Need to organise the mission / Appropriate means of communication for calling for help if necessary / Specific training on the environment / Compulsory health and safety training for participants. + Advance preparation for the mission: recommendations by the mission leader. Two people must be present for the entire mission, means of communication between team members. + Equipment validation by the mission leader, consideration of load issues for carrying equipment, checks by the mission leader. + Accompaniment either by a person from the laboratory with the necessary skills and knowledge of the terrain or by a professional (see remarks).\nField bell"]
[]
[]
["Côte ","Technical instructions","Colonne1"]
[1,"Suitable for the weather conditions of the mission: Jacket/T-shirt, trousers/shorts, trainers, sunglasses, cap/hat/lightweight beanie."]
[2,"Suitable for the weather conditions of the mission: Jacket/T-shirt, trousers/shorts, trainers, sunglasses, cap/hat/lightweight beanie. + Suitable for the terrain: Trainers or high-top trainers."]
[3,"Suitable for the weather conditions of the mission: Jacket/T-shirt, trousers/shorts, trainers, sunglasses, cap/hat/lightweight beanie. + Suitable for the terrain: Trainers or high-top trainers. + Specific to the terrain: Walking shoes, gloves, warm underwear, light trousers, windproof jacket, breathable or woollen T-shirt, water bottle, helmet and gaiters. "]
[4,"Suitable for the weather conditions of the mission: Jacket/T-shirt, trousers/shorts, trainers, sunglasses, cap/hat/lightweight beanie. + Suitable for the terrain: Trainers or high-top trainers. + Specific to the terrain: Walking shoes, gloves, warm underwear, light trousers, windproof jacket, breathable or woollen T-shirt, water bottle, helmet and gaiters. + Technical and personal protective equipment: Ropes, harnesses, water, breathable long johns. "]
[5,"Suitable for the weather conditions of the mission: Jacket/T-shirt, trousers/shorts, trainers, sunglasses, cap/hat/lightweight beanie. + Suitable for the terrain: Trainers or high-top trainers. + Specific to the terrain: Walking shoes, gloves, warm underwear, light trousers, windproof jacket, breathable or woollen T-shirt, water bottle, helmet and gaiters. + Technical and personal protective equipment: Ropes, harnesses, water, breathable long johns. + Specific to high mountains: Skis, rock climbing equipment, crampons, ice axe, high mountain trousers, fleece or jumper, Gore-Tex jacket, pair of gloves/hat, mountain boots."]
[]
[]
[]
[]
[]
[null,null,null,null,null,null,null,null,null,null,null,null,null,null,null,null,{"$f":"VBAProject.Module2.MaCondition(Q6,R10)","v":"Conditions non valides"}]
[]
[]
[]
[]
[]
[]
[]
[]
[]
[]
[]
[]
[]
[]
[]
[null,"Cote"]

{"sheet":"Mission assessment","index":3,"n_rows":1805,"n_cols":38,"rows_kept":1805,"cut":false,"hidden":false,"merged":[[28,17,29,19],[0,24,0,37],[0,21,0,22],[1,24,1,28],[1,29,1,32],[1,33,1,34],[1,35,1,37],[0,17,0,19],[25,0,27,6],[9,17,9,19],[15,17,15,19],[0,14,0,15],[1,0,1,6],[0,8,0,12],[0,0,0,6],[8,17,8,19],[13,17,14,19]]}
[null,null,null,null,null,null,null,null,"LICENCE",null,null,null,null,null,"SST",null,null,"Pre-mission risk assessment criteria",null,null,null,"Aggravating factors",null,null,"Obligations of the head of mission (the head of mission validates or rejects the obligations)"]
[null,null,null,null,null,null,null,null,null,null,null,null,null,null,null,null,null,"Maximum slope used ","Nature of the terrain (NT), Most challenging type of terrain","Progression or working conditions (CPT)",null,"Distance to vehicle","Carrying conditions",null,"Obligations of the head of mission prior to departure ",null,null,null,null,"Obligations of the head of mission during the mission",null,null,null,"Intervention by personnel from outside the laboratory",null,"Incidents / Accidents"]
["Level of responsibility","First name, surname","Date of entry","Mission start date","Mission end date","Nature of mission","Place of work",null,"B","C","E(B)","Moutain guide ","Moutain accompanist",null,"SST","SST hostile environments",null,"Slope greater than 84%","Rock face / Glacier","Icy",null,"More than 1 km","Heavy and bulky",null,"Specific information about the mission was provided: instructions each day before departure (each person's role and mission, etc.).","Checking that participants' equipment and PPE are in good condition.","Check the compatibility of staff fatigue with the mission every day.","Checking weather conditions and the avalanche risk bulletin (BRA) in the event of snowfall.","Field first aid kit","He undertakes to check the equipment during the mission and to modify it or the mission if necessary.","Ensures safety at all times","Undertakes to terminate the mission, return to a secure location, or implement an emergency procedure. He has sole authority for these decisions.","In the event of an accident, undertakes to attend to the victim and raise the alarm. Immediately alerts the DU and AP. He submits a detailed report to the DU upon his return from the mission.","Working together: an agreement has been signed","Concurrent works: has a prevention plan been signed?","Means of communication provided.","The members of the group are first-aiders.","For missions outside the EU: Ensure that rescue resources are available."]
[]
["Technical manager of the mission","tutu","2025-10-22","2025-10-23","2025-10-23","test mission","Moye",null,"No longer valid","No longer valid","No longer valid","No longer valid","No longer valid",null,null,null,null,"PM","NT","CPT",null,"DV","CP"]
["Qualified operator","toto",null,null,null,null,null,null,null,null,null,null,null,null,"No longer valid",null,null,{"$f":"VLOOKUP(R3,'Selection list'!A23:B27,2,FALSE)","v":5},{"$f":"VLOOKUP(S3,'Selection list'!A30:B34,2,FALSE)","v":5},{"$f":"VLOOKUP(T3,'Selection list'!A37:B41,2,FALSE)","v":5},null,{"$f":"VLOOKUP(V3,'Selection list'!E23:F27,2,FALSE)","v":4},{"$f":"VLOOKUP(W3,Tableau7[],2,FALSE)","v":5},null,"Yes","Yes","Yes","Yes","Yes","Yes","Yes","Yes","Yes","Yes","Yes","Yes","Not applicable","Not applicable"]
["Scientific mission manager","titi",null,null,null,null,null,null,null,null,null,null,null,null,null,"Yes",null,null,null,null,null,null,null,null,{"$f":"VLOOKUP(Y6,Tableau13[],2,FALSE)","v":1},{"$f":"VLOOKUP(Z6,Tableau13[],2,FALSE)","v":1},{"$f":"VLOOKUP(AA6,Tableau13[],2,FALSE)","v":1},{"$f":"VLOOKUP(AB6,Tableau13[],2,FALSE)","v":1},{"$f":"VLOOKUP(AC6,Tableau13[],2,FALSE)","v":1},{"$f":"VLOOKUP(AD6,Tableau13[],2,FALSE)","v":1},{"$f":"VLOOKUP(AE6,Tableau13[],2,FALSE)","v":1},{"$f":"VLOOKUP(AF6,Tableau13[],2,FALSE)","v":1},{"$f":"VLOOKUP(AG6,Tableau13[],2,FALSE)","v":1},{"$f":"VLOOKUP(AH6,Tableau13[],2,FALSE)","v":1},{"$f":"VLOOKUP(AI6,Tableau13[],2,FALSE)","v":1},{"$f":"VLOOKUP(AJ6,Tableau13[],2,FALSE)","v":1},{"$f":"VLOOKUP(AK6,Tableau13[],2,FALSE)","v":1},{"$f":"VLOOKUP(AL6,Tableau13[],2,FALSE)","v":1}]
[null,null,null,null,null,null,null,null,null,null,null,null,null,null,"No longer valid","No longer valid"]
[null,null,null,null,null,null,null,null,null,null,null,null,null,null,null,null,null,"Risk level before application of the head of mission's obligations"]
[null,null,null,null,null,null,null,null,null,null,null,null,null,null,null,null,null,{"$f":"PRODUCT(POWER(PRODUCT(R6,S6,T6),1/3),V6,W6)","v":100.00000000000001}]
[]
[null,null,null,null,null,null,null,null,null,null,null,null,null,null,null,null,null,null,null," "]
[]
[null,null,null,null,null,null,null,null,null,null,null,null,null,null,null,null,null,"Risk level after application of the head of mission's obligations"]
[]
[null,null,null,null,null,null,null,null,null,null,"Yes",null,null,null,null,null,null,{"$f":"(R10-SUM(Y7:AL7)*2)","v":72.000000000000014}]
[]
[]
[]
[null,null,null,null,null,null,null,null,null,null,null,null,null,null,null,null,null,{"$f":"MAX(R6:T6)","v":5},null,"Côte"]
[null,null,null,null,null,null,null,null,null,null,null,null,null,null,null,null,null,null,null,{"$f":"R20","v":5}]
[]
[]
[]
[]
["The technical leader of the mission is the person on the ground who takes responsibility for deploying personnel and equipment. He makes his decisions based on the group's level of fatigue and changing weather conditions."]
[]
[]
[null,null,null,null,null,null,null,null,null,null,null,null,null,null,null,null,null,"If the score displays ‘error’, it means that some of the criteria selected are not permitted for this type of assignment (see the Notice tab)."]
[]
[]
[]
[]
[]
[]
[]
[]
[]
[]
[]
[]
[]
[]
[]
[]
[]
[]
[]
[]
[]
[]
[]
[]
[]
[]
[]
[]
[]
[]
[]
[]
[]
[]
[]
[]
[]
[]
[]
[]
[]
[]
[]
[]
[]
[]
[]
[]
[]
[]
[]
[]
[]
[]
[]
[]
[]
[]
[]
[]
[]
[]
[]
[]
[]
[]
[]
[]
[]
[]
[]
[]
[]
[]
[]
[]
[]
[]
[]
[]
[]
[]
[]
[]
[]
[]
[]
[]
[]
[]
[]
[]
[]
[]
[]
[]
[]
[]
[]
[]
[]
[]
[]
[]
[]
[]
[]
[]
[]
[]
[]
[]
[]
[]
[]
[]
[]
[]
[]
[]
[]
[]
[]
[]
[]
[]
[]
[]
[]
[]
[]
[]
[]
[]
[]
[]
[]
[]
[]
[]
[]
[]
[]
[]
[]
[]
[]
[]
[]
[]
[]
[]
[]
[]
[]
[]
[]
[]
[]
[]
[]
[]
[]
[]
[]
[]
[]
[]
[]
[]
[]
{"$rows_left_out":1606}
{"sheet":"Assessment summary","index":4,"n_rows":38,"n_cols":16,"rows_kept":38,"cut":false,"hidden":false,"merged":[[24,15,25,16],[26,9,26,14],[16,9,17,14],[20,9,21,14],[22,9,22,14],[18,9,18,14],[35,9,35,14],[32,9,32,14],[33,9,33,14],[34,9,34,14],[24,9,25,14],[27,9,28,14],[29,9,30,14],[27,15,28,16],[26,15,26,16],[32,15,32,16],[36,9,36,14],[37,9,37,14],[38,0,38,4],[33,0,33,1],[30,6,30,7],[32,6,32,7],[0,10,0,14],[0,4,0,7],[1,4,1,7],[1,9,5,16],[7,10,7,14],[9,9,12,16],[15,9,15,14],[14,10,14,14],[18,15,18,16],[20,15,21,16],[19,15,19,16],[23,9,23,14],[0,1,3,1],[30,0,30,3],[37,15,37,16],[36,15,36,16],[35,15,35,16],[34,15,34,16],[33,15,33,16],[34,0,34,1],[15,15,15,16],[16,15,17,16],[23,15,23,16],[22,15,22,16],[19,9,19,14],[31,9,31,14],[31,15,31,16],[29,15,30,16]]}
[null,"Outdoor environments* and mountains                             *Excluding lakes and underground environments",null,null,"Date of entry",null,null,null,null,null,"Technical instructions"]
[null,null,null,null,"2025-10-22T11:21:34",null,null,null,null,{"$f":"VLOOKUP('Mission assessment'!T21,Tableau12[[Côte ]:[Technical instructions]],2,FALSE)","v":"Suitable for the weather conditions of the mission: Jacket/T-shirt, trousers/shorts, trainers, sunglasses, cap/hat/lightweight beanie. + Suitable for the terrain: Trainers or high-top trainers. + Specific to the terrain: Walking shoes, gloves, warm underwear, light trousers, windproof jacket, breathable or woollen T-shirt, water bottle, helmet and gaiters. + Technical and personal protective equipment: Ropes, harnesses, water, breathable long johns. + Specific to high mountains: Skis, rock climbing equipment, crampons, ice axe, high mountain trousers, fleece or jumper, Gore-Tex jacket, pair of gloves/hat, mountain boots."}]
[]
[]
[]
[]
[null,"Organisation of the mission"]
["Place of work",{"$f":"'Mission assessment'!G5","v":"Moye"},null,null,null,null,null,null,null,null,"Organisational instructions"]
["Nature of the mission",{"$f":"'Mission assessment'!F5","v":"test mission"}]
["Mission start date",{"$f":"'Mission assessment'!D5","v":"2025-10-23"},null,null,null,null,null,null,null,{"$f":"VLOOKUP('Mission assessment'!T21,'Organistion and technical instr'!A4:B8,2,FALSE)","v":"Mission order. + Need to organise the mission / Appropriate means of communication for calling for help if necessary / Specific training on the environment / Compulsory health and safety training for participants. + Advance preparation for the mission: recommendations by the mission leader. Two people must be present for the entire mission, means of communication between team members. + Equipment validation by the mission leader, consideration of load issues for carrying equipment, checks by the mission leader. + Accompaniment either by a person from the laboratory with the necessary skills and knowledge of the terrain or by a professional (see remarks).\nField bell"}]
["Mission end date",{"$f":"'Mission assessment'!E5","v":"2025-10-23"}]
[]
[null,null,"B","C","E(B)","Moutain guide","Moutain accompanist","SST","SST Milieux hostiles"]
["Responsable mission",{"$f":"'Mission assessment'!B5","v":"tutu"},{"$f":"'Mission assessment'!I5:M20","v":"No longer valid"},"No longer valid","No longer valid","No longer valid","No longer valid",{"$f":"'Mission assessment'!O5:P20","v":0},0]
[{"$f":"'Mission assessment'!A6:B20","v":"Qualified operator"},"toto",0,0,0,0,0,"No longer valid",0,null,"Obligations of the head of mission"]
["Scientific mission manager","titi",0,0,0,0,0,0,"Yes",{"$f":"'Mission assessment'!Y2","v":"Obligations of the head of mission prior to departure "},null,null,null,null,null,"Results"]
[0,0,0,0,0,0,0,"No longer valid","No longer valid",{"$f":"'Mission assessment'!Y3","v":"Specific information about the mission was provided: instructions each day before departure (each person's role and mission, etc.)."},null,null,null,null,null,{"$f":"'Mission assessment'!Y6","v":"Yes"}]
[0,0,0,0,0,0,0,0,0]
[0,0,0,0,0,0,0,0,0,{"$f":"'Mission assessment'!Z3","v":"Checking that participants' equipment and PPE are in good condition."},null,null,null,null,null,{"$f":"'Mission assessment'!Z6","v":"Yes"}]
[0,0,0,0,0,0,0,0,0,{"$f":"'Mission assessment'!AA3","v":"Check the compatibility of staff fatigue with the mission every day."},null,null,null,null,null,{"$f":"'Mission assessment'!AA6","v":"Yes"}]
[0,0,0,0,0,0,0,0,0,{"$f":"'Mission assessment'!AB3","v":"Checking weather conditions and the avalanche risk bulletin (BRA) in the event of snowfall."},null,null,null,null,null,{"$f":"'Mission assessment'!AB6","v":"Yes"}]
[0,0,0,0,0,0,0,0,0]
[0,0,0,0,0,0,0,0,0,{"$f":"'Mission assessment'!AC3","v":"Field first aid kit"},null,null,null,null,null,{"$f":"'Mission assessment'!AC6","v":"Yes"}]
[0,0,0,0,0,0,0,0,0,{"$f":"'Mission assessment'!AD2","v":"Obligations of the head of mission during the mission"}]
[0,0,0,0,"Yes",0,0,0,0,{"$f":"'Mission assessment'!AD3","v":"He undertakes to check the equipment during the mission and to modify it or the mission if necessary."},null,null,null,null,null,{"$f":"'Mission assessment'!AD6","v":"Yes"}]
[0,0,0,0,0,0,0,0,0]
[0,0,0,0,0,0,0,0,0,{"$f":"'Mission assessment'!AE3","v":"Ensures safety at all times"},null,null,null,null,null,{"$f":"'Mission assessment'!AE6","v":"Yes"}]
[0,0,0,0,0,0,0,0,0,{"$f":"'Mission assessment'!AF3","v":"Undertakes to terminate the mission, return to a secure location, or implement an emergency procedure. He has sole authority for these decisions."},null,null,null,null,null,{"$f":"'Mission assessment'!AF6","v":"Yes"}]
[0,0,0,0,0,0,0,0,0]
[null,null,null,null,null,null,null,null,null,{"$f":"'Mission assessment'!AG3","v":"In the event of an accident, undertakes to attend to the victim and raise the alarm. Immediately alerts the DU and AP. He submits a detailed report to the DU upon his return from the mission."},null,null,null,null,null,{"$f":"'Mission assessment'!AG6","v":"Yes"}]
["Risk level before application of the head of mission's obligations (0 à 100)",null,null,null,null,null,{"$f":"'Mission assessment'!R10","v":100.00000000000001}]
[null,null,null,null,null,null,null,null,null,{"$f":"'Mission assessment'!AH2","v":"Intervention by personnel from outside the laboratory"}]
["Risk level after application of the head of mission's obligations (0 à 100)",null,null,null,null,null,{"$f":"'Mission assessment'!R16","v":72.000000000000014},null,null,{"$f":"'Mission assessment'!AH3","v":"Working together: an agreement has been signed"},null,null,null,null,null,{"$f":"'Mission assessment'!AH6","v":"Yes"}]
[null,null,{"$f":"'Mission assessment'!R6","v":5},null,null,null,null,null,null,{"$f":"'Mission assessment'!AI3","v":"Concurrent works: has a prevention plan been signed?"},null,null,null,null,null,{"$f":"'Mission assessment'!AI6","v":"Yes"}]
[null,null,null,null,null,null,null,null,null,{"$f":"'Mission assessment'!AJ2","v":"Incidents / Accidents"}]
[null,null,null,null,null,null,null,null,null,{"$f":"'Mission assessment'!AJ3","v":"Means of communication provided."},null,null,null,null,null,{"$f":"'Mission assessment'!AJ6","v":"Yes"}]
[null,null,null,null,null,null,null,null,null,{"$f":"'Mission assessment'!AK3","v":"The members of the group are first-aiders."},null,null,null,null,null,{"$f":"'Mission assessment'!AK6","v":"Not applicable"}]
[null,null,null,null,null,null,null,null,null,{"$f":"'Mission assessment'!AL3","v":"For missions outside the EU: Ensure that rescue resources are available."},null,null,null,null,null,{"$f":"'Mission assessment'!AL6","v":"Not applicable"}]