{"text_format":"1","workbook":"xlsx","n_sheets":5,"sheets":["Notice","Selection list","organisational and technical in","Mission assessment","Synthèse de l'évaluation"],"not_rendered":{"charts":0,"images":0,"macros":1,"external_links":0,"defined_names":10,"comments":0,"pivot_tables":0},"unopened":[],"bounds":{"document_bytes":16777216,"sheet_cells":100000,"rows_first":2000,"rows_last":500,"rows_between":2000,"halvings":0,"cell_chars":16384,"cell_head_chars":4096},"cells_cut":0,"cells_raw":0,"read":"whole","date_system":"1900"}

{"sheet":"Notice","index":0,"n_rows":22,"n_cols":5,"rows_kept":22,"cut":false,"hidden":false,"merged":[[2,4,10,4],[15,2,15,4]]}
[]
[null,"Table color code",null,null,"User Manual"]
[null,null,null,null,"On the ‘MissionAssessment’ sheet, you must first enter the most challenging type of cavity in terms of progression or the working area.  You must then enter the various people involved in the mission and their level of qualification, as well as the location and dates of the mission.Next, enter the risk factors and aggravating factors, as well as the obligations of the mission leader. Finalise the entry by clicking on the ‘Approve this assessment’ button.  Then go to the results sheet, which summarises your answers, and export this summary sheet: ‘File/Export/’."]
[]
[null,"Valididy"]
[]
[null,"No","No training completed"]
[]
[null,"No longeur valide","Unvalid training"]
[]
[null,"Yes","Valid training"]
[]
[]
[]
[]
[null,null,"Type of cavity"]
[null,null,"Cavity class"]
[null,null,0,null,"Cavity fitted out for tourism 5 or horizontal underground research laboratory equipped with lighting"]
[null,null,1,null,"Cavité or portion of cavity requiring no equipment other than a helmet with lighting"]
[null,null,2,null,"Cavity or portion of a cavity for beginners or discovery. Obstacles are occasional. Overcoming them, which may require equipment, is suitable for beginners. The presence of water should not prevent the group from progressing."]
[null,null,3,null,"Cavités ou portion de cavité dont les obstacles peuvent s'enchaîner. L'ensemble des verticales ne doit pas excéder quelques dizaines de mètres, de préférence en plusieurs tronçons."]
[null,null,4,null,"All other cavity"]

{"sheet":"Selection list","index":1,"n_rows":58,"n_cols":6,"rows_kept":58,"cut":false,"hidden":false,"merged":[]}
["No","No training complete"]
["No longer valid","Unvalid training"]
["Yes","Valid training"]
["-"]
[]
[]
[]
["No","No"]
["Yes","Yes"]
[]
[]
[{"$f":"TODAY()","v":"2025-11-14"}]
[]
[]
["Participants à la mission"]
["Colonne1","Colonne2"]
["Head of Underground Operations","COS"]
["Underground Operator","OS"]
[]
[null,null,null,null,"Facteurs agravants"]
[null,null,null,null,"Vehicule distance"]
[null,null,null,null,"Colonne1","Colonne2"]
[null,null,null,null,"Less than 50 m",1]
["Niveaux de qualification",null,null,null,"Between 50 and 200 m",2]
[null,null,null,null,"Between 200 and 500 m",3]
["Colonne1","Colonne2",null,null,"Between 500 m and 1 km",4]
["Without Competence",0,null,null,"More than 1 km",5]
["Recognised 0, 1 and 2 ",1,null,null,"Carrying conditions"]
["Recognised 0, 1, 2 and 3 ",1,null,null,"Colonne1","Colonne2"]
["Recognised 0, 1,2, 3 and 4 ",1,null,null,"No carrying required",1]
["Graduate Class 0, 1, and 2",10,null,null,"Lightweight and compact",2]
["Graduate Class 0, 1, 2, and 3",10,null,null,"Lightweight and bulky",3]
["Graduate Class 0, 1, 2, 3, and 4",10,null,null,"Heavy and compact",4]
[null,null,null,null,"Heavy and bulky",5]
[null,null,null,null,"Type of cavity"]
[null,null,null,null,"Colonne1","Colonne2"]
[null,null,null,null,0,1]
[null,null,null,null,1,2]
[null,null,null,null,2,3]
[null,null,null,null,3,4]
[null,null,null,null,4,5]
[null,null,null,null,"supervisory position"]
[null,null,null,null,"Colonne1","Colonne2"]
[null,null,null,null,"Without supervisory",1]
[null,null,null,null,"With supervisory",2]
[]
[]
[null,null,null,null,"Checkbox"]
[null,null,null,null,"Colonne1","Colonne2"]
[null,null,null,null,"Not applicable",1]
[null,null,null,null,"Yes",1]
[null,null,null,null,"No",0]
[]
[]
[null,null,null,null,"Checkbox"]
[null,null,null,null,"Colonne1","Colonne2"]
[null,null,null,null,"Yes",1]
[null,null,null,null,"No",0]

{"sheet":"organisational and technical in","index":2,"n_rows":38,"n_cols":20,"rows_kept":38,"cut":false,"hidden":false,"merged":[]}
[]
[null,null,null,null,null,null,null,null,null,null,null,null,null,null,null,null,null,null,null,"Conditions de la mission"]
["Cavité","Consignes Organisationnelle"]
[0,"Mission order. Working alone is prohibited; however, an agent may, in exceptional circumstances, enter a class 0 or 1 cavity alone, provided that the necessary safety precautions have been taken. To do so, they must have informed the DU, the AP and the person in charge of underground activities of the precise location of the site, the cavity or portion of the cavity, the alert procedures, the planned entry and exit times, and their actual exit time."]
[1,"Mission order. Working alone is prohibited; however, an agent may, in exceptional circumstances, enter a class 0 or 1 cavity alone, provided that the necessary safety precautions have been taken. To do so, they must have informed the DU, the AP and the person in charge of underground activities of the precise location of the site, the cave or section of cave, the alert procedures, the planned entry and exit times, and their actual exit time. + At least one competent person with technical skills appropriate to the terrain."]
[2,"Mission order. Working alone is prohibited. At least one person competent in caving, acting as the underground operation manager to supervise a group of up to 8 people (i.e. 9 people maximum), at least SST or PSC1, ideally SST in isolated environments, alert procedure. For the underground operation leader:  valid state diploma (DEJEPS with specialisation in caving) or federal certificate issued by the FFS (initiator, monitor or instructor) and first aid training (up-to-date SST or PSC1)."]
[3,"Mission order. Working alone is prohibited. A minimum of two people competent in caving are required to supervise a group of up to eight people (i.e. groups of up to ten). One of the two acts as the leader of the underground operation.  At a minimum, SST or PSC1 certification is required; ideally, SST certification for isolated environments and alert procedures. For the underground operation leader:  valid state diploma (DEJEPS with specialisation in caving) or federal certificate issued by the FFS (initiator, monitor or instructor) and first aid training (up-to-date SST or PSC1)."]
[4,"Mission order. Working alone is prohibited. A minimum of two people competent in caving are required to supervise a group of up to eight people (i.e. groups of up to ten). One of the two acts as the leader of the underground operation.  At a minimum, SST or PSC1 certification is required; ideally, SST certification for isolated environments and alert procedures. For the underground operation leader:  valid state diploma (DEJEPS with specialisation in caving) or federal certificate issued by the FFS (initiator, monitor or instructor) and first aid training (up-to-date SST or PSC1)."]
[]
[]
["Cavité","Consignes techniques","Colonne1"]
[0,"First aid kit"]
[1,"First aid kit + Helmet with light and double lighting for working alone. "]
[2,"First aid kit + Helmet with light and double lighting for working alone. + Caving suit, helmet with light and spare batteries, and boots"]
[3,"First aid kit + Helmet with light and double lighting for working alone. + Caving suit, helmet with light and spare batteries, and boots  = Vertical progression equipment"]
[4,"First aid kit + Helmet with light and double lighting for working alone. + Caving suit, helmet with light and spare batteries, and boots  = Vertical progression equipment"]
[]
[]
[]
[]
[]
[null,null,null,null,null,null,null,null,null,null,null,null,null,null,null,null,{"$f":"VBAProject.Module2.MaCondition(Q6,R10)","v":"Conditions non valides"}]
[]
[]
[]
[]
[]
[]
[]
[]
[]
[]
[]
[]
[]
[]
[]
[null,"Cote"]

{"sheet":"Mission assessment","index":3,"n_rows":1805,"n_cols":42,"rows_kept":1805,"cut":false,"hidden":false,"merged":[[19,29,21,36],[17,30,17,33],[14,33,14,37],[15,34,15,36],[4,18,5,24],[8,33,8,37],[9,34,9,36],[32,1,32,9],[10,18,11,19],[10,20,11,24],[16,21,17,24],[16,18,17,20],[18,18,18,19],[19,18,19,19],[20,18,20,19],[26,29,26,32],[14,1,16,9],[23,5,25,9],[0,15,0,16],[1,1,1,9],[0,11,0,13],[12,29,12,32],[0,18,0,24],[0,0,0,9],[1,18,1,24],[0,29,0,41],[0,26,0,27],[1,29,1,33],[1,34,1,37],[1,38,1,39],[1,40,1,41]]}
["Mission description",null,null,null,null,null,null,null,null,null,null,"Licence",null,null,null,"SST",null,null,"Pre-mission risk assessment criteria",null,null,null,null,null,null,null,"Aggravanting factors",null,null,"Obligations of the head of mission (the head of mission validates or rejects the obligations)"]
[null,null,null,null,null,null,null,null,null,null,null,null,null,null,null,null,null,null,"Risk assessment",null,null,null,null,null,null,null,"Distance to vehicule","Carying conditions",null,"Obligations of the head of mission prior to departure ",null,null,null,null,"Obligations of the head of mission during the missionn",null,null,null,"Intervention by personnel from outside the laboratory",null,"Incidents / Accidents"]
["Type of cavity that is most restrictive in terms of movement or work","Level of responsability","First Name, surname","Level of qualification","Date of entry","Mission start date","Mission end date","Nature of the mission","Supervision type","Working place",null,"B","C","E(B)",null,"SST","SST hostile environments",null,null,null,null,null,null,null,null,null,"Between 500 m and 1 km","Lightweight and bulky",null,"Specific information about the mission was provided: instructions each day before departure (each person's role and mission, etc.).","Checking that participants' equipment and PPE are in good condition.","Check the compatibility of staff fatigue with the mission every day","Checking weather and hydrological reports","Field first aid kit","He undertakes to check the equipment during the mission and to modify it or the mission if necessary.","Ensures safety at all times","Undertakes to terminate the mission, return to a secure location, or implement an emergency procedure. He has sole authority for these decisions.","In the event of an accident, undertakes to attend to the victim and raise the alarm. Immediately alerts the DU and AP. He submits a detailed report to the DU upon his return from the mission.","Working together: an agreement has been signed","Concurrent works: has a prevention plan been signed?","The members of the group are first-aiders.","For missions outside the EU: Ensure that rescue resources are available."]
[]
[1,"Head of Underground Operations","toto","Graduate Class 0, 1, 2, 3, and 4","2025-10-23","2025-10-29","2025-10-30","carottage  spéléothème","With supervisory","moye",null,"No longer valid","No longer valid","No longer valid",null,"No longer valid","No longer valid",null,"Natural risks",null,null,null,null,null,null,null,"DV","CP"]
[null,"Underground Operator","tutu","Recognised 0, 1 and 2 ",null,null,null,null,null,null,null,"Yes",null,null,null,null,null,null,null,null,null,null,null,null,null,null,{"$f":"VLOOKUP(AA3,Tableau6[],2,FALSE)","v":4},{"$f":"VLOOKUP(AB3,Tableau7[],2,FALSE)","v":3},null,"Yes","Yes","Yes","Yes","No","No","Yes","No","No","Not applicable","Not applicable","No","Not applicable"]
[null,"Underground Operator","titi","Recognised 0, 1, 2 and 3 ",null,null,null,null,null,null,null,null,null,"No",null,"Yes",null,null,"Flood risk","Unstable rocks","Venomous animals","Risk of zoonosis (bats)","Mushrooms (mould inhalation)","Risk of leptospirosis (contaminated water)","Others",null,null,null,null,{"$f":"VLOOKUP(AD6,Tableau13[],2,FALSE)","v":1},{"$f":"VLOOKUP(AE6,Tableau13[],2,FALSE)","v":1},{"$f":"VLOOKUP(AF6,Tableau13[],2,FALSE)","v":1},{"$f":"VLOOKUP(AG6,Tableau13[],2,FALSE)","v":1},{"$f":"VLOOKUP(AH6,Tableau13[],2,FALSE)","v":0},{"$f":"VLOOKUP(AI6,Tableau13[],2,FALSE)","v":0},{"$f":"VLOOKUP(AJ6,Tableau13[],2,FALSE)","v":1},{"$f":"VLOOKUP(AK6,Tableau13[],2,FALSE)","v":0},{"$f":"VLOOKUP(AL6,Tableau13[],2,FALSE)","v":0},{"$f":"VLOOKUP(AM6,Tableau13[],2,FALSE)","v":1},{"$f":"VLOOKUP(AN6,Tableau13[],2,FALSE)","v":1},{"$f":"VLOOKUP(AO6,Tableau13[],2,FALSE)","v":0},{"$f":"VLOOKUP(AP6,Tableau13[],2,FALSE)","v":1}]
[null,"Underground Operator","tata","Graduate Class 0, 1, and 2",null,null,null,null,null,null,null,"Yes",null,null,null,null,"No",null,"Yes","Yes","No","Yes","No","Yes","No"]
[null,null,null,null,null,null,null,null,null,null,null,null,null,null,null,null,null,null,{"$f":"VLOOKUP(S8,Tableau1311[],2,FALSE)","v":1},{"$f":"VLOOKUP(T8,Tableau1311[],2,FALSE)","v":1},{"$f":"VLOOKUP(U8,Tableau1311[],2,FALSE)","v":0},{"$f":"VLOOKUP(V8,Tableau1311[],2,FALSE)","v":1},{"$f":"VLOOKUP(W8,Tableau1311[],2,FALSE)","v":0},{"$f":"VLOOKUP(X8,Tableau1311[],2,FALSE)","v":1},{"$f":"VLOOKUP(Y8,Tableau1311[],2,FALSE)","v":0},null,null,null,null,"Niveau risque cavité",{"$f":"VLOOKUP(A5,Tableau8[],2,FALSE)","v":2},null,null,"Risk level before application of the head of mission's obligations"]
[null,null,null,null,null,null,null,null,null,null,null,null,null,null,null,null,null,null,null,null,null,null,null,null,null,null,null,null,null,"Encadrement",{"$f":"VLOOKUP(I5,Tableau9[],2,FALSE)","v":2},null,null,null,{"$f":"PRODUCT(AE9,AE10,AE11)/2","v":18}]
[null,null,null,null,null,null,null,null,null,null,null,null,null,null,null,null,null,null,"Working at height",null,"Working conditions",null,null,null,null,null,null,null,null,"Critères",{"$f":"SUM(S9,T9,U9,V9,W9,X9,Y9,S15,T15,U15,V15,W15,X15,Y15,S21,U21,V21,W21,X21,Y21)","v":9}]
[]
[null,null,null,null,null,null,null,null,null,null,null,null,null,null,null,null,null,null,"Risk of falling","Risk of falling objects","Noise","Dusting","Temperature","Long water activities","Sea spray"]
[null,null,null,null,null,null,null,null,null,null,null,null,null,null,null,null,null,null,"No","Yes","No","No","No","Yes","No"]
[null," The head of underground operations (technical mission manager) is the person on the ground who is responsible for deploying personnel and equipment. He makes his decisions based on the fatigue level of the group and changing weather conditions.",null,null,null,null,null,null,null,null,null,null,null,null,null,null,null,null,{"$f":"VLOOKUP(S14,Tableau1311[],2,FALSE)","v":0},{"$f":"VLOOKUP(T14,Tableau1311[],2,FALSE)","v":1},{"$f":"VLOOKUP(U14,Tableau1311[],2,FALSE)","v":0},{"$f":"VLOOKUP(V14,Tableau1311[],2,FALSE)","v":0},{"$f":"VLOOKUP(W14,Tableau1311[],2,FALSE)","v":0},{"$f":"VLOOKUP(X14,Tableau1311[],2,FALSE)","v":1},{"$f":"VLOOKUP(Y14,Tableau1311[],2,FALSE)","v":0},null,null,null,null,null,null,null,null,"Risk level after application of the head of mission's obligations"]
[null,null,null,null,null,null,null,null,null,null,null,null,null,null,null,null,null,null,null,null,null,null,null,null,null,null,null,null,null,null,null,null,null,null,{"$f":"AI10-SUM(AP7,AO7,AN7,AM7,AL7,AK7,AJ7,AI7,AH7,AG7,AF7,AE7,AD7)*2","v":2}]
[null,null,null,null,null,null,null,null,null,null,null,null,null,null,null,null,null,null,"Specific conditions",null,null,"Lifting and moving loads"]
[null,null,null,null,null,null,null,null,null,null,null,null,null,null,null,null,null,null,null,null,null,null,null,null,null,null,null,null,null,null,"Note aboute the mission :"]
[null,null,null,null,null,null,null,null,null,null,null,null,null,null,null,null,null,null,"Presence of gases (CO₂, CO, CH₄, H₂S, radon, others)",null,"risk of anoxia","Load capacity >5 kg per person","Carrying distance >50m","Lowering and raising equipment on rock faces","Obstacle to overcome"]
[null,null,null,null,null,null,null,null,null,null,null,null,null,null,null,null,null,null,"Yes",null,"No","No","Yes","No","Yes",null,null,null,null,"For a type 1 cavity, mission only possible under organisational conditions. "]
[null,null,null,null,null,null,null,null,null,null,null,null,null,null,null,null,null,null,{"$f":"VLOOKUP(S20,Tableau1311[],2,FALSE)","v":1},null,{"$f":"VLOOKUP(U20,Tableau1311[],2,FALSE)","v":0},{"$f":"VLOOKUP(V20,Tableau1311[],2,FALSE)","v":0},{"$f":"VLOOKUP(W20,Tableau1311[],2,FALSE)","v":1},{"$f":"VLOOKUP(X20,Tableau1311[],2,FALSE)","v":0},{"$f":"VLOOKUP(Y20,Tableau1311[],2,FALSE)","v":1}]
[]
[]
[]
[]
[]
[]
[]
[]
[]
[]
[]
[]
[]
[]
[]
[]
[]
[]
[]
[]
[]
[]
[]
[]
[]
[]
[]
[]
[]
[]
[]
[]
[]
[]
[]
[]
[]
[]
[]
[]
[]
[]
[]
[]
[]
[]
[]
[]
[]
[]
[]
[]
[]
[]
[]
[]
[]
[]
[]
[]
[]
[]
[]
[]
[]
[]
[]
[]
[]
[]
[]
[]
[]
[]
[]
[]
[]
[]
[]
[]
[]
[]
[]
[]
[]
[]
[]
[]
[]
[]
[]
[]
[]
[]
[]
[]
[]
[]
[]
[]
[]
[]
[]
[]
[]
[]
[]
[]
[]
[]
[]
[]
[]
[]
[]
[]
[]
[]
[]
[]
[]
[]
[]
[]
[]
[]
[]
[]
[]
[]
[]
[]
[]
[]
[]
[]
[]
[]
[]
[]
[]
[]
[]
[]
[]
[]
[]
[]
[]
[]
[]
[]
[]
[]
[]
[]
[]
[]
[]
[]
[]
[]
[]
[]
[]
[]
[]
[]
[]
[]
[]
[]
[]
[]
[]
[]
[]
[]
[]
[]
[]
[]
[]
[]
[]
[]
[]
[]
[]
[]
[]
[]
[]
[]
[]
[]
[]
[]
[]
[]
[]
[]
[]
[]
[]
[]
[]
[]
[]
[]
[]
[]
[]
[]
[]
[]
[]
[]
[]
[]
[]
[]
[]
[]
[]
[]
[]
[]
[]
[]
[]
[]
[]
[]
[]
[]
[]
[]
[]
[]
[]
[]
[]
[]
[]
[]
[]
[]
[]
[]
[]
[]
[]
[]
[]
[]
[]
[]
[]
[]
[]
[]
[]
[]
[]
[]
[]
[]
[]
[]
[]
[]
[]
[]
[]
[]
[]
[]
[]
[]
[]
[]
[]
[]
[]
[]
[]
[]
[]
[]
[]
[]
[]
[]
[]
[]
[]
[]
[]
[]
[]
[]
[]
[]
[]
[]
[]
[]
[]
[]
[]
[]
[]
[]
[]
[]
[]
[]
[]
[]
[]
[]
[]
[]
[null,null,null,null,null,null,null,null,null,null,null,null,null,null,null,{"$f":"IF(#REF!=\"\",\"\",IF(#REF!<TODAY(),0,IF(#REF!<(TODAY()+365),1,\"X\")))","v":{"$error":"#REF!"}},{"$f":"IF(#REF!=\"\",\"\",\"X\")","v":{"$error":"#REF!"}}]
[null,null,null,null,null,null,null,null,null,null,null,null,null,null,null,{"$f":"IF(#REF!=\"\",\"\",IF(#REF!<TODAY(),0,IF(#REF!<(TODAY()+365),1,\"X\")))","v":{"$error":"#REF!"}},{"$f":"IF(#REF!=\"\",\"\",\"X\")","v":{"$error":"#REF!"}}]
[null,null,null,null,null,null,null,null,null,null,null,null,null,null,null,{"$f":"IF(#REF!=\"\",\"\",IF(#REF!<TODAY(),0,IF(#REF!<(TODAY()+365),1,\"X\")))","v":{"$error":"#REF!"}},{"$f":"IF(#REF!=\"\",\"\",\"X\")","v":{"$error":"#REF!"}}]
[null,null,null,null,null,null,null,null,null,null,null,null,null,null,null,{"$f":"IF(#REF!=\"\",\"\",IF(#REF!<TODAY(),0,IF(#REF!<(TODAY()+365),1,\"X\")))","v":{"$error":"#REF!"}},{"$f":"IF(#REF!=\"\",\"\",\"X\")","v":{"$error":"#REF!"}}]
[null,null,null,null,null,null,null,null,null,null,null,null,null,null,null,{"$f":"IF(#REF!=\"\",\"\",IF(#REF!<TODAY(),0,IF(#REF!<(TODAY()+365),1,\"X\")))","v":{"$error":"#REF!"}},{"$f":"IF(#REF!=\"\",\"\",\"X\")","v":{"$error":"#REF!"}}]
[null,null,null,null,null,null,null,null,null,null,null,null,null,null,null,{"$f":"IF(#REF!=\"\",\"\",IF(#REF!<TODAY(),0,IF(#REF!<(TODAY()+365),1,\"X\")))","v":{"$error":"#REF!"}},{"$f":"IF(#REF!=\"\",\"\",\"X\")","v":{"$error":"#REF!"}}]
[null,null,null,null,null,null,null,null,null,null,null,null,null,null,null,{"$f":"IF(#REF!=\"\",\"\",IF(#REF!<TODAY(),0,IF(#REF!<(TODAY()+365),1,\"X\")))","v":{"$error":"#REF!"}},{"$f":"IF(#REF!=\"\",\"\",\"X\")","v":{"$error":"#REF!"}}]
[null,null,null,null,null,null,null,null,null,null,null,null,null,null,null,{"$f":"IF(#REF!=\"\",\"\",IF(#REF!<TODAY(),0,IF(#REF!<(TODAY()+365),1,\"X\")))","v":{"$error":"#REF!"}},{"$f":"IF(#REF!=\"\",\"\",\"X\")","v":{"$error":"#REF!"}}]
[null,null,null,null,null,null,null,null,null,null,null,null,null,null,null,{"$f":"IF(#REF!=\"\",\"\",IF(#REF!<TODAY(),0,IF(#REF!<(TODAY()+365),1,\"X\")))","v":{"$error":"#REF!"}},{"$f":"IF(#REF!=\"\",\"\",\"X\")","v":{"$error":"#REF!"}}]
[null,null,null,null,null,null,null,null,null,null,null,null,null,null,null,{"$f":"IF(#REF!=\"\",\"\",IF(#REF!<TODAY(),0,IF(#REF!<(TODAY()+365),1,\"X\")))","v":{"$error":"#REF!"}},{"$f":"IF(#REF!=\"\",\"\",\"X\")","v":{"$error":"#REF!"}}]
[null,null,null,null,null,null,null,null,null,null,null,null,null,null,null,{"$f":"IF(#REF!=\"\",\"\",IF(#REF!<TODAY(),0,IF(#REF!<(TODAY()+365),1,\"X\")))","v":{"$error":"#REF!"}},{"$f":"IF(#REF!=\"\",\"\",\"X\")","v":{"$error":"#REF!"}}]
[null,null,null,null,null,null,null,null,null,null,null,null,null,null,null,{"$f":"IF(#REF!=\"\",\"\",IF(#REF!<TODAY(),0,IF(#REF!<(TODAY()+365),1,\"X\")))","v":{"$error":"#REF!"}},{"$f":"IF(#REF!=\"\",\"\",\"X\")","v":{"$error":"#REF!"}}]
[null,null,null,null,null,null,null,null,null,null,null,null,null,null,null,{"$f":"IF(#REF!=\"\",\"\",IF(#REF!<TODAY(),0,IF(#REF!<(TODAY()+365),1,\"X\")))","v":{"$error":"#REF!"}},{"$f":"IF(#REF!=\"\",\"\",\"X\")","v":{"$error":"#REF!"}}]
[null,null,null,null,null,null,null,null,null,null,null,null,null,null,null,{"$f":"IF(#REF!=\"\",\"\",IF(#REF!<TODAY(),0,IF(#REF!<(TODAY()+365),1,\"X\")))","v":{"$error":"#REF!"}},{"$f":"IF(#REF!=\"\",\"\",\"X\")","v":{"$error":"#REF!"}}]
[null,null,null,null,null,null,null,null,null,null,null,null,null,null,null,{"$f":"IF(#REF!=\"\",\"\",IF(#REF!<TODAY(),0,IF(#REF!<(TODAY()+365),1,\"X\")))","v":{"$error":"#REF!"}},{"$f":"IF(#REF!=\"\",\"\",\"X\")","v":{"$error":"#REF!"}}]
[null,null,null,null,null,null,null,null,null,null,null,null,null,null,null,{"$f":"IF(#REF!=\"\",\"\",IF(#REF!<TODAY(),0,IF(#REF!<(TODAY()+365),1,\"X\")))","v":{"$error":"#REF!"}},{"$f":"IF(#REF!=\"\",\"\",\"X\")","v":{"$error":"#REF!"}}]
[null,null,null,null,null,null,null,null,null,null,null,null,null,null,null,{"$f":"IF(#REF!=\"\",\"\",IF(#REF!<TODAY(),0,IF(#REF!<(TODAY()+365),1,\"X\")))","v":{"$error":"#REF!"}},{"$f":"IF(#REF!=\"\",\"\",\"X\")","v":{"$error":"#REF!"}}]
[null,null,null,null,null,null,null,null,null,null,null,null,null,null,null,{"$f":"IF(#REF!=\"\",\"\",IF(#REF!<TODAY(),0,IF(#REF!<(TODAY()+365),1,\"X\")))","v":{"$error":"#REF!"}},{"$f":"IF(#REF!=\"\",\"\",\"X\")","v":{"$error":"#REF!"}}]
[null,null,null,null,null,null,null,null,null,null,null,null,null,null,null,{"$f":"IF(#REF!=\"\",\"\",IF(#REF!<TODAY(),0,IF(#REF!<(TODAY()+365),1,\"X\")))","v":{"$error":"#REF!"}},{"$f":"IF(#REF!=\"\",\"\",\"X\")","v":{"$error":"#REF!"}}]
[null,null,null,null,null,null,null,null,null,null,null,null,null,null,null,{"$f":"IF(#REF!=\"\",\"\",IF(#REF!<TODAY(),0,IF(#REF!<(TODAY()+365),1,\"X\")))","v":{"$error":"#REF!"}},{"$f":"IF(#REF!=\"\",\"\",\"X\")","v":{"$error":"#REF!"}}]
[null,null,null,null,null,null,null,null,null,null,null,null,null,null,null,{"$f":"IF(#REF!=\"\",\"\",IF(#REF!<TODAY(),0,IF(#REF!<(TODAY()+365),1,\"X\")))","v":{"$error":"#REF!"}},{"$f":"IF(#REF!=\"\",\"\",\"X\")","v":{"$error":"#REF!"}}]
[null,null,null,null,null,null,null,null,null,null,null,null,null,null,null,{"$f":"IF(#REF!=\"\",\"\",IF(#REF!<TODAY(),0,IF(#REF!<(TODAY()+365),1,\"X\")))","v":{"$error":"#REF!"}},{"$f":"IF(#REF!=\"\",\"\",\"X\")","v":{"$error":"#REF!"}}]
[null,null,null,null,null,null,null,null,null,null,null,null,null,null,null,{"$f":"IF(#REF!=\"\",\"\",IF(#REF!<TODAY(),0,IF(#REF!<(TODAY()+365),1,\"X\")))","v":{"$error":"#REF!"}},{"$f":"IF(#REF!=\"\",\"\",\"X\")","v":{"$error":"#REF!"}}]
[null,null,null,null,null,null,null,null,null,null,null,null,null,null,null,{"$f":"IF(#REF!=\"\",\"\",IF(#REF!<TODAY(),0,IF(#REF!<(TODAY()+365),1,\"X\")))","v":{"$error":"#REF!"}},{"$f":"IF(#REF!=\"\",\"\",\"X\")","v":{"$error":"#REF!"}}]
[null,null,null,null,null,null,null,null,null,null,null,null,null,null,null,{"$f":"IF(#REF!=\"\",\"\",IF(#REF!<TODAY(),0,IF(#REF!<(TODAY()+365),1,\"X\")))","v":{"$error":"#REF!"}},{"$f":"IF(#REF!=\"\",\"\",\"X\")","v":{"$error":"#REF!"}}]
[null,null,null,null,null,null,null,null,null,null,null,null,null,null,null,{"$f":"IF(#REF!=\"\",\"\",IF(#REF!<TODAY(),0,IF(#REF!<(TODAY()+365),1,\"X\")))","v":{"$error":"#REF!"}},{"$f":"IF(#REF!=\"\",\"\",\"X\")","v":{"$error":"#REF!"}}]
[null,null,null,null,null,null,null,null,null,null,null,null,null,null,null,{"$f":"IF(#REF!=\"\",\"\",IF(#REF!<TODAY(),0,IF(#REF!<(TODAY()+365),1,\"X\")))","v":{"$error":"#REF!"}},{"$f":"IF(#REF!=\"\",\"\",\"X\")","v":{"$error":"#REF!"}}]
[null,null,null,null,null,null,null,null,null,null,null,null,null,null,null,{"$f":"IF(#REF!=\"\",\"\",IF(#REF!<TODAY(),0,IF(#REF!<(TODAY()+365),1,\"X\")))","v":{"$error":"#REF!"}},{"$f":"IF(#REF!=\"\",\"\",\"X\")","v":{"$error":"#REF!"}}]
[null,null,null,null,null,null,null,null,null,null,null,null,null,null,null,{"$f":"IF(#REF!=\"\",\"\",IF(#REF!<TODAY(),0,IF(#REF!<(TODAY()+365),1,\"X\")))","v":{"$error":"#REF!"}},{"$f":"IF(#REF!=\"\",\"\",\"X\")","v":{"$error":"#REF!"}}]
[null,null,null,null,null,null,null,null,null,null,null,null,null,null,null,{"$f":"IF(#REF!=\"\",\"\",IF(#REF!<TODAY(),0,IF(#REF!<(TODAY()+365),1,\"X\")))","v":{"$error":"#REF!"}},{"$f":"IF(#REF!=\"\",\"\",\"X\")","v":{"$error":"#REF!"}}]
[null,null,null,null,null,null,null,null,null,null,null,null,null,null,null,{"$f":"IF(#REF!=\"\",\"\",IF(#REF!<TODAY(),0,IF(#REF!<(TODAY()+365),1,\"X\")))","v":{"$error":"#REF!"}},{"$f":"IF(#REF!=\"\",\"\",\"X\")","v":{"$error":"#REF!"}}]
[null,null,null,null,null,null,null,null,null,null,null,null,null,null,null,{"$f":"IF(#REF!=\"\",\"\",IF(#REF!<TODAY(),0,IF(#REF!<(TODAY()+365),1,\"X\")))","v":{"$error":"#REF!"}},{"$f":"IF(#REF!=\"\",\"\",\"X\")","v":{"$error":"#REF!"}}]
[null,null,null,null,null,null,null,null,null,null,null,null,null,null,null,{"$f":"IF(#REF!=\"\",\"\",IF(#REF!<TODAY(),0,IF(#REF!<(TODAY()+365),1,\"X\")))","v":{"$error":"#REF!"}},{"$f":"IF(#REF!=\"\",\"\",\"X\")","v":{"$error":"#REF!"}}]
[null,null,null,null,null,null,null,null,null,null,null,null,null,null,null,{"$f":"IF(#REF!=\"\",\"\",IF(#REF!<TODAY(),0,IF(#REF!<(TODAY()+365),1,\"X\")))","v":{"$error":"#REF!"}},{"$f":"IF(#REF!=\"\",\"\",\"X\")","v":{"$error":"#REF!"}}]
[null,null,null,null,null,null,null,null,null,null,null,null,null,null,null,{"$f":"IF(#REF!=\"\",\"\",IF(#REF!<TODAY(),0,IF(#REF!<(TODAY()+365),1,\"X\")))","v":{"$error":"#REF!"}},{"$f":"IF(#REF!=\"\",\"\",\"X\")","v":{"$error":"#REF!"}}]
[null,null,null,null,null,null,null,null,null,null,null,null,null,null,null,{"$f":"IF(#REF!=\"\",\"\",IF(#REF!<TODAY(),0,IF(#REF!<(TODAY()+365),1,\"X\")))","v":{"$error":"#REF!"}},{"$f":"IF(#REF!=\"\",\"\",\"X\")","v":{"$error":"#REF!"}}]
[null,null,null,null,null,null,null,null,null,null,null,null,null,null,null,{"$f":"IF(#REF!=\"\",\"\",IF(#REF!<TODAY(),0,IF(#REF!<(TODAY()+365),1,\"X\")))","v":{"$error":"#REF!"}},{"$f":"IF(#REF!=\"\",\"\",\"X\")","v":{"$error":"#REF!"}}]
[null,null,null,null,null,null,null,null,null,null,null,null,null,null,null,{"$f":"IF(#REF!=\"\",\"\",IF(#REF!<TODAY(),0,IF(#REF!<(TODAY()+365),1,\"X\")))","v":{"$error":"#REF!"}},{"$f":"IF(#REF!=\"\",\"\",\"X\")","v":{"$error":"#REF!"}}]
[null,null,null,null,null,null,null,null,null,null,null,null,null,null,null,{"$f":"IF(#REF!=\"\",\"\",IF(#REF!<TODAY(),0,IF(#REF!<(TODAY()+365),1,\"X\")))","v":{"$error":"#REF!"}},{"$f":"IF(#REF!=\"\",\"\",\"X\")","v":{"$error":"#REF!"}}]
[null,null,null,null,null,null,null,null,null,null,null,null,null,null,null,{"$f":"IF(#REF!=\"\",\"\",IF(#REF!<TODAY(),0,IF(#REF!<(TODAY()+365),1,\"X\")))","v":{"$error":"#REF!"}},{"$f":"IF(#REF!=\"\",\"\",\"X\")","v":{"$error":"#REF!"}}]
[null,null,null,null,null,null,null,null,null,null,null,null,null,null,null,{"$f":"IF(#REF!=\"\",\"\",IF(#REF!<TODAY(),0,IF(#REF!<(TODAY()+365),1,\"X\")))","v":{"$error":"#REF!"}},{"$f":"IF(#REF!=\"\",\"\",\"X\")","v":{"$error":"#REF!"}}]
[null,null,null,null,null,null,null,null,null,null,null,null,null,null,null,{"$f":"IF(#REF!=\"\",\"\",IF(#REF!<TODAY(),0,IF(#REF!<(TODAY()+365),1,\"X\")))","v":{"$error":"#REF!"}},{"$f":"IF(#REF!=\"\",\"\",\"X\")","v":{"$error":"#REF!"}}]
[null,null,null,null,null,null,null,null,null,null,null,null,null,null,null,{"$f":"IF(#REF!=\"\",\"\",IF(#REF!<TODAY(),0,IF(#REF!<(TODAY()+365),1,\"X\")))","v":{"$error":"#REF!"}},{"$f":"IF(#REF!=\"\",\"\",\"X\")","v":{"$error":"#REF!"}}]
[null,null,null,null,null,null,null,null,null,null,null,null,null,null,null,{"$f":"IF(#REF!=\"\",\"\",IF(#REF!<TODAY(),0,IF(#REF!<(TODAY()+365),1,\"X\")))","v":{"$error":"#REF!"}},{"$f":"IF(#REF!=\"\",\"\",\"X\")","v":{"$error":"#REF!"}}]
[null,null,null,null,null,null,null,null,null,null,null,null,null,null,null,{"$f":"IF(#REF!=\"\",\"\",IF(#REF!<TODAY(),0,IF(#REF!<(TODAY()+365),1,\"X\")))","v":{"$error":"#REF!"}},{"$f":"IF(#REF!=\"\",\"\",\"X\")","v":{"$error":"#REF!"}}]
[null,null,null,null,null,null,null,null,null,null,null,null,null,null,null,{"$f":"IF(#REF!=\"\",\"\",IF(#REF!<TODAY(),0,IF(#REF!<(TODAY()+365),1,\"X\")))","v":{"$error":"#REF!"}},{"$f":"IF(#REF!=\"\",\"\",\"X\")","v":{"$error":"#REF!"}}]
[null,null,null,null,null,null,null,null,null,null,null,null,null,null,null,{"$f":"IF(#REF!=\"\",\"\",IF(#REF!<TODAY(),0,IF(#REF!<(TODAY()+365),1,\"X\")))","v":{"$error":"#REF!"}},{"$f":"IF(#REF!=\"\",\"\",\"X\")","v":{"$error":"#REF!"}}]
[null,null,null,null,null,null,null,null,null,null,null,null,null,null,null,{"$f":"IF(#REF!=\"\",\"\",IF(#REF!<TODAY(),0,IF(#REF!<(TODAY()+365),1,\"X\")))","v":{"$error":"#REF!"}},{"$f":"IF(#REF!=\"\",\"\",\"X\")","v":{"$error":"#REF!"}}]
[null,null,null,null,null,null,null,null,null,null,null,null,null,null,null,{"$f":"IF(#REF!=\"\",\"\",IF(#REF!<TODAY(),0,IF(#REF!<(TODAY()+365),1,\"X\")))","v":{"$error":"#REF!"}},{"$f":"IF(#REF!=\"\",\"\",\"X\")","v":{"$error":"#REF!"}}]
[null,null,null,null,null,null,null,null,null,null,null,null,null,null,null,{"$f":"IF(#REF!=\"\",\"\",IF(#REF!<TODAY(),0,IF(#REF!<(TODAY()+365),1,\"X\")))","v":{"$error":"#REF!"}},{"$f":"IF(#REF!=\"\",\"\",\"X\")","v":{"$error":"#REF!"}}]
[null,null,null,null,null,null,null,null,null,null,null,null,null,null,null,{"$f":"IF(#REF!=\"\",\"\",IF(#REF!<TODAY(),0,IF(#REF!<(TODAY()+365),1,\"X\")))","v":{"$error":"#REF!"}},{"$f":"IF(#REF!=\"\",\"\",\"X\")","v":{"$error":"#REF!"}}]
[null,null,null,null,null,null,null,null,null,null,null,null,null,null,null,{"$f":"IF(#REF!=\"\",\"\",IF(#REF!<TODAY(),0,IF(#REF!<(TODAY()+365),1,\"X\")))","v":{"$error":"#REF!"}},{"$f":"IF(#REF!=\"\",\"\",\"X\")","v":{"$error":"#REF!"}}]
[null,null,null,null,null,null,null,null,null,null,null,null,null,null,null,{"$f":"IF(#REF!=\"\",\"\",IF(#REF!<TODAY(),0,IF(#REF!<(TODAY()+365),1,\"X\")))","v":{"$error":"#REF!"}},{"$f":"IF(#REF!=\"\",\"\",\"X\")","v":{"$error":"#REF!"}}]
[null,null,null,null,null,null,null,null,null,null,null,null,null,null,null,{"$f":"IF(#REF!=\"\",\"\",IF(#REF!<TODAY(),0,IF(#REF!<(TODAY()+365),1,\"X\")))","v":{"$error":"#REF!"}},{"$f":"IF(#REF!=\"\",\"\",\"X\")","v":{"$error":"#REF!"}}]
[null,null,null,null,null,null,null,null,null,null,null,null,null,null,null,{"$f":"IF(#REF!=\"\",\"\",IF(#REF!<TODAY(),0,IF(#REF!<(TODAY()+365),1,\"X\")))","v":{"$error":"#REF!"}},{"$f":"IF(#REF!=\"\",\"\",\"X\")","v":{"$error":"#REF!"}}]
[null,null,null,null,null,null,null,null,null,null,null,null,null,null,null,{"$f":"IF(#REF!=\"\",\"\",IF(#REF!<TODAY(),0,IF(#REF!<(TODAY()+365),1,\"X\")))","v":{"$error":"#REF!"}},{"$f":"IF(#REF!=\"\",\"\",\"X\")","v":{"$error":"#REF!"}}]
[null,null,null,null,null,null,null,null,null,null,null,null,null,null,null,{"$f":"IF(#REF!=\"\",\"\",IF(#REF!<TODAY(),0,IF(#REF!<(TODAY()+365),1,\"X\")))","v":{"$error":"#REF!"}},{"$f":"IF(#REF!=\"\",\"\",\"X\")","v":{"$error":"#REF!"}}]
[null,null,null,null,null,null,null,null,null,null,null,null,null,null,null,{"$f":"IF(#REF!=\"\",\"\",IF(#REF!<TODAY(),0,IF(#REF!<(TODAY()+365),1,\"X\")))","v":{"$error":"#REF!"}},{"$f":"IF(#REF!=\"\",\"\",\"X\")","v":{"$error":"#REF!"}}]
[null,null,null,null,null,null,null,null,null,null,null,null,null,null,null,{"$f":"IF(#REF!=\"\",\"\",IF(#REF!<TODAY(),0,IF(#REF!<(TODAY()+365),1,\"X\")))","v":{"$error":"#REF!"}},{"$f":"IF(#REF!=\"\",\"\",\"X\")","v":{"$error":"#REF!"}}]
[null,null,null,null,null,null,null,null,null,null,null,null,null,null,null,{"$f":"IF(#REF!=\"\",\"\",IF(#REF!<TODAY(),0,IF(#REF!<(TODAY()+365),1,\"X\")))","v":{"$error":"#REF!"}},{"$f":"IF(#REF!=\"\",\"\",\"X\")","v":{"$error":"#REF!"}}]
[null,null,null,null,null,null,null,null,null,null,null,null,null,null,null,{"$f":"IF(#REF!=\"\",\"\",IF(#REF!<TODAY(),0,IF(#REF!<(TODAY()+365),1,\"X\")))","v":{"$error":"#REF!"}},{"$f":"IF(#REF!=\"\",\"\",\"X\")","v":{"$error":"#REF!"}}]
[null,null,null,null,null,null,null,null,null,null,null,null,null,null,null,{"$f":"IF(#REF!=\"\",\"\",IF(#REF!<TODAY(),0,IF(#REF!<(TODAY()+365),1,\"X\")))","v":{"$error":"#REF!"}},{"$f":"IF(#REF!=\"\",\"\",\"X\")","v":{"$error":"#REF!"}}]
[null,null,null,null,null,null,null,null,null,null,null,null,null,null,null,{"$f":"IF(#REF!=\"\",\"\",IF(#REF!<TODAY(),0,IF(#REF!<(TODAY()+365),1,\"X\")))","v":{"$error":"#REF!"}},{"$f":"IF(#REF!=\"\",\"\",\"X\")","v":{"$error":"#REF!"}}]
[null,null,null,null,null,null,null,null,null,null,null,null,null,null,null,{"$f":"IF(#REF!=\"\",\"\",IF(#REF!<TODAY(),0,IF(#REF!<(TODAY()+365),1,\"X\")))","v":{"$error":"#REF!"}},{"$f":"IF(#REF!=\"\",\"\",\"X\")","v":{"$error":"#REF!"}}]
[null,null,null,null,null,null,null,null,null,null,null,null,null,null,null,{"$f":"IF(#REF!=\"\",\"\",IF(#REF!<TODAY(),0,IF(#REF!<(TODAY()+365),1,\"X\")))","v":{"$error":"#REF!"}},{"$f":"IF(#REF!=\"\",\"\",\"X\")","v":{"$error":"#REF!"}}]
[null,null,null,null,null,null,null,null,null,null,null,null,null,null,null,{"$f":"IF(#REF!=\"\",\"\",IF(#REF!<TODAY(),0,IF(#REF!<(TODAY()+365),1,\"X\")))","v":{"$error":"#REF!"}},{"$f":"IF(#REF!=\"\",\"\",\"X\")","v":{"$error":"#REF!"}}]
[null,null,null,null,null,null,null,null,null,null,null,null,null,null,null,{"$f":"IF(#REF!=\"\",\"\",IF(#REF!<TODAY(),0,IF(#REF!<(TODAY()+365),1,\"X\")))","v":{"$error":"#REF!"}},{"$f":"IF(#REF!=\"\",\"\",\"X\")","v":{"$error":"#REF!"}}]
[null,null,null,null,null,null,null,null,null,null,null,null,null,null,null,{"$f":"IF(#REF!=\"\",\"\",IF(#REF!<TODAY(),0,IF(#REF!<(TODAY()+365),1,\"X\")))","v":{"$error":"#REF!"}},{"$f":"IF(#REF!=\"\",\"\",\"X\")","v":{"$error":"#REF!"}}]
[null,null,null,null,null,null,null,null,null,null,null,null,null,null,null,{"$f":"IF(#REF!=\"\",\"\",IF(#REF!<TODAY(),0,IF(#REF!<(TODAY()+365),1,\"X\")))","v":{"$error":"#REF!"}},{"$f":"IF(#REF!=\"\",\"\",\"X\")","v":{"$error":"#REF!"}}]
[null,null,null,null,null,null,null,null,null,null,null,null,null,null,null,{"$f":"IF(#REF!=\"\",\"\",IF(#REF!<TODAY(),0,IF(#REF!<(TODAY()+365),1,\"X\")))","v":{"$error":"#REF!"}},{"$f":"IF(#REF!=\"\",\"\",\"X\")","v":{"$error":"#REF!"}}]
[null,null,null,null,null,null,null,null,null,null,null,null,null,null,null,{"$f":"IF(#REF!=\"\",\"\",IF(#REF!<TODAY(),0,IF(#REF!<(TODAY()+365),1,\"X\")))","v":{"$error":"#REF!"}},{"$f":"IF(#REF!=\"\",\"\",\"X\")","v":{"$error":"#REF!"}}]
[null,null,null,null,null,null,null,null,null,null,null,null,null,null,null,{"$f":"IF(#REF!=\"\",\"\",IF(#REF!<TODAY(),0,IF(#REF!<(TODAY()+365),1,\"X\")))","v":{"$error":"#REF!"}},{"$f":"IF(#REF!=\"\",\"\",\"X\")","v":{"$error":"#REF!"}}]
[null,null,null,null,null,null,null,null,null,null,null,null,null,null,null,{"$f":"IF(#REF!=\"\",\"\",IF(#REF!<TODAY(),0,IF(#REF!<(TODAY()+365),1,\"X\")))","v":{"$error":"#REF!"}},{"$f":"IF(#REF!=\"\",\"\",\"X\")","v":{"$error":"#REF!"}}]
[null,null,null,null,null,null,null,null,null,null,null,null,null,null,null,{"$f":"IF(#REF!=\"\",\"\",IF(#REF!<TODAY(),0,IF(#REF!<(TODAY()+365),1,\"X\")))","v":{"$error":"#REF!"}},{"$f":"IF(#REF!=\"\",\"\",\"X\")","v":{"$error":"#REF!"}}]
[null,null,null,null,null,null,null,null,null,null,null,null,null,null,null,{"$f":"IF(#REF!=\"\",\"\",IF(#REF!<TODAY(),0,IF(#REF!<(TODAY()+365),1,\"X\")))","v":{"$error":"#REF!"}},{"$f":"IF(#REF!=\"\",\"\",\"X\")","v":{"$error":"#REF!"}}]
[null,null,null,null,null,null,null,null,null,null,null,null,null,null,null,{"$f":"IF(#REF!=\"\",\"\",IF(#REF!<TODAY(),0,IF(#REF!<(TODAY()+365),1,\"X\")))","v":{"$error":"#REF!"}},{"$f":"IF(#REF!=\"\",\"\",\"X\")","v":{"$error":"#REF!"}}]
[null,null,null,null,null,null,null,null,null,null,null,null,null,null,null,{"$f":"IF(#REF!=\"\",\"\",IF(#REF!<TODAY(),0,IF(#REF!<(TODAY()+365),1,\"X\")))","v":{"$error":"#REF!"}},{"$f":"IF(#REF!=\"\",\"\",\"X\")","v":{"$error":"#REF!"}}]
[null,null,null,null,null,null,null,null,null,null,null,null,null,null,null,{"$f":"IF(#REF!=\"\",\"\",IF(#REF!<TODAY(),0,IF(#REF!<(TODAY()+365),1,\"X\")))","v":{"$error":"#REF!"}},{"$f":"IF(#REF!=\"\",\"\",\"X\")","v":{"$error":"#REF!"}}]
[null,null,null,null,null,null,null,null,null,null,null,null,null,null,null,{"$f":"IF(#REF!=\"\",\"\",IF(#REF!<TODAY(),0,IF(#REF!<(TODAY()+365),1,\"X\")))","v":{"$error":"#REF!"}},{"$f":"IF(#REF!=\"\",\"\",\"X\")","v":{"$error":"#REF!"}}]
[null,null,null,null,null,null,null,null,null,null,null,null,null,null,null,{"$f":"IF(#REF!=\"\",\"\",IF(#REF!<TODAY(),0,IF(#REF!<(TODAY()+365),1,\"X\")))","v":{"$error":"#REF!"}},{"$f":"IF(#REF!=\"\",\"\",\"X\")","v":{"$error":"#REF!"}}]
[null,null,null,null,null,null,null,null,null,null,null,null,null,null,null,{"$f":"IF(#REF!=\"\",\"\",IF(#REF!<TODAY(),0,IF(#REF!<(TODAY()+365),1,\"X\")))","v":{"$error":"#REF!"}},{"$f":"IF(#REF!=\"\",\"\",\"X\")","v":{"$error":"#REF!"}}]
[null,null,null,null,null,null,null,null,null,null,null,null,null,null,null,{"$f":"IF(#REF!=\"\",\"\",IF(#REF!<TODAY(),0,IF(#REF!<(TODAY()+365),1,\"X\")))","v":{"$error":"#REF!"}},{"$f":"IF(#REF!=\"\",\"\",\"X\")","v":{"$error":"#REF!"}}]
[null,null,null,null,null,null,null,null,null,null,null,null,null,null,null,{"$f":"IF(#REF!=\"\",\"\",IF(#REF!<TODAY(),0,IF(#REF!<(TODAY()+365),1,\"X\")))","v":{"$error":"#REF!"}},{"$f":"IF(#REF!=\"\",\"\",\"X\")","v":{"$error":"#REF!"}}]
[null,null,null,null,null,null,null,null,null,null,null,null,null,null,null,{"$f":"IF(#REF!=\"\",\"\",IF(#REF!<TODAY(),0,IF(#REF!<(TODAY()+365),1,\"X\")))","v":{"$error":"#REF!"}},{"$f":"IF(#REF!=\"\",\"\",\"X\")","v":{"$error":"#REF!"}}]
[null,null,null,null,null,null,null,null,null,null,null,null,null,null,null,{"$f":"IF(#REF!=\"\",\"\",IF(#REF!<TODAY(),0,IF(#REF!<(TODAY()+365),1,\"X\")))","v":{"$error":"#REF!"}},{"$f":"IF(#REF!=\"\",\"\",\"X\")","v":{"$error":"#REF!"}}]
[null,null,null,null,null,null,null,null,null,null,null,null,null,null,null,{"$f":"IF(#REF!=\"\",\"\",IF(#REF!<TODAY(),0,IF(#REF!<(TODAY()+365),1,\"X\")))","v":{"$error":"#REF!"}},{"$f":"IF(#REF!=\"\",\"\",\"X\")","v":{"$error":"#REF!"}}]
[null,null,null,null,null,null,null,null,null,null,null,null,null,null,null,{"$f":"IF(#REF!=\"\",\"\",IF(#REF!<TODAY(),0,IF(#REF!<(TODAY()+365),1,\"X\")))","v":{"$error":"#REF!"}},{"$f":"IF(#REF!=\"\",\"\",\"X\")","v":{"$error":"#REF!"}}]
[null,null,null,null,null,null,null,null,null,null,null,null,null,null,null,{"$f":"IF(#REF!=\"\",\"\",IF(#REF!<TODAY(),0,IF(#REF!<(TODAY()+365),1,\"X\")))","v":{"$error":"#REF!"}},{"$f":"IF(#REF!=\"\",\"\",\"X\")","v":{"$error":"#REF!"}}]
[null,null,null,null,null,null,null,null,null,null,null,null,null,null,null,{"$f":"IF(#REF!=\"\",\"\",IF(#REF!<TODAY(),0,IF(#REF!<(TODAY()+365),1,\"X\")))","v":{"$error":"#REF!"}},{"$f":"IF(#REF!=\"\",\"\",\"X\")","v":{"$error":"#REF!"}}]
[null,null,null,null,null,null,null,null,null,null,null,null,null,null,null,{"$f":"IF(#REF!=\"\",\"\",IF(#REF!<TODAY(),0,IF(#REF!<(TODAY()+365),1,\"X\")))","v":{"$error":"#REF!"}},{"$f":"IF(#REF!=\"\",\"\",\"X\")","v":{"$error":"#REF!"}}]
[null,null,null,null,null,null,null,null,null,null,null,null,null,null,null,{"$f":"IF(#REF!=\"\",\"\",IF(#REF!<TODAY(),0,IF(#REF!<(TODAY()+365),1,\"X\")))","v":{"$error":"#REF!"}},{"$f":"IF(#REF!=\"\",\"\",\"X\")","v":{"$error":"#REF!"}}]
[null,null,null,null,null,null,null,null,null,null,null,null,null,null,null,{"$f":"IF(#REF!=\"\",\"\",IF(#REF!<TODAY(),0,IF(#REF!<(TODAY()+365),1,\"X\")))","v":{"$error":"#REF!"}},{"$f":"IF(#REF!=\"\",\"\",\"X\")","v":{"$error":"#REF!"}}]
[null,null,null,null,null,null,null,null,null,null,null,null,null,null,null,{"$f":"IF(#REF!=\"\",\"\",IF(#REF!<TODAY(),0,IF(#REF!<(TODAY()+365),1,\"X\")))","v":{"$error":"#REF!"}},{"$f":"IF(#REF!=\"\",\"\",\"X\")","v":{"$error":"#REF!"}}]
[null,null,null,null,null,null,null,null,null,null,null,null,null,null,null,{"$f":"IF(#REF!=\"\",\"\",IF(#REF!<TODAY(),0,IF(#REF!<(TODAY()+365),1,\"X\")))","v":{"$error":"#REF!"}},{"$f":"IF(#REF!=\"\",\"\",\"X\")","v":{"$error":"#REF!"}}]
[null,null,null,null,null,null,null,null,null,null,null,null,null,null,null,{"$f":"IF(#REF!=\"\",\"\",IF(#REF!<TODAY(),0,IF(#REF!<(TODAY()+365),1,\"X\")))","v":{"$error":"#REF!"}},{"$f":"IF(#REF!=\"\",\"\",\"X\")","v":{"$error":"#REF!"}}]
[null,null,null,null,null,null,null,null,null,null,null,null,null,null,null,{"$f":"IF(#REF!=\"\",\"\",IF(#REF!<TODAY(),0,IF(#REF!<(TODAY()+365),1,\"X\")))","v":{"$error":"#REF!"}},{"$f":"IF(#REF!=\"\",\"\",\"X\")","v":{"$error":"#REF!"}}]
[null,null,null,null,null,null,null,null,null,null,null,null,null,null,null,{"$f":"IF(#REF!=\"\",\"\",IF(#REF!<TODAY(),0,IF(#REF!<(TODAY()+365),1,\"X\")))","v":{"$error":"#REF!"}},{"$f":"IF(#REF!=\"\",\"\",\"X\")","v":{"$error":"#REF!"}}]
[null,null,null,null,null,null,null,null,null,null,null,null,null,null,null,{"$f":"IF(#REF!=\"\",\"\",IF(#REF!<TODAY(),0,IF(#REF!<(TODAY()+365),1,\"X\")))","v":{"$error":"#REF!"}},{"$f":"IF(#REF!=\"\",\"\",\"X\")","v":{"$error":"#REF!"}}]
[null,null,null,null,null,null,null,null,null,null,null,null,null,null,null,{"$f":"IF(#REF!=\"\",\"\",IF(#REF!<TODAY(),0,IF(#REF!<(TODAY()+365),1,\"X\")))","v":{"$error":"#REF!"}},{"$f":"IF(#REF!=\"\",\"\",\"X\")","v":{"$error":"#REF!"}}]
[null,null,null,null,null,null,null,null,null,null,null,null,null,null,null,{"$f":"IF(#REF!=\"\",\"\",IF(#REF!<TODAY(),0,IF(#REF!<(TODAY()+365),1,\"X\")))","v":{"$error":"#REF!"}},{"$f":"IF(#REF!=\"\",\"\",\"X\")","v":{"$error":"#REF!"}}]
[null,null,null,null,null,null,null,null,null,null,null,null,null,null,null,{"$f":"IF(#REF!=\"\",\"\",IF(#REF!<TODAY(),0,IF(#REF!<(TODAY()+365),1,\"X\")))","v":{"$error":"#REF!"}},{"$f":"IF(#REF!=\"\",\"\",\"X\")","v":{"$error":"#REF!"}}]
[null,null,null,null,null,null,null,null,null,null,null,null,null,null,null,{"$f":"IF(#REF!=\"\",\"\",IF(#REF!<TODAY(),0,IF(#REF!<(TODAY()+365),1,\"X\")))","v":{"$error":"#REF!"}},{"$f":"IF(#REF!=\"\",\"\",\"X\")","v":{"$error":"#REF!"}}]
[null,null,null,null,null,null,null,null,null,null,null,null,null,null,null,{"$f":"IF(#REF!=\"\",\"\",IF(#REF!<TODAY(),0,IF(#REF!<(TODAY()+365),1,\"X\")))","v":{"$error":"#REF!"}},{"$f":"IF(#REF!=\"\",\"\",\"X\")","v":{"$error":"#REF!"}}]
[null,null,null,null,null,null,null,null,null,null,null,null,null,null,null,{"$f":"IF(#REF!=\"\",\"\",IF(#REF!<TODAY(),0,IF(#REF!<(TODAY()+365),1,\"X\")))","v":{"$error":"#REF!"}},{"$f":"IF(#REF!=\"\",\"\",\"X\")","v":{"$error":"#REF!"}}]
[null,null,null,null,null,null,null,null,null,null,null,null,null,null,null,{"$f":"IF(#REF!=\"\",\"\",IF(#REF!<TODAY(),0,IF(#REF!<(TODAY()+365),1,\"X\")))","v":{"$error":"#REF!"}},{"$f":"IF(#REF!=\"\",\"\",\"X\")","v":{"$error":"#REF!"}}]
[null,null,null,null,null,null,null,null,null,null,null,null,null,null,null,{"$f":"IF(#REF!=\"\",\"\",IF(#REF!<TODAY(),0,IF(#REF!<(TODAY()+365),1,\"X\")))","v":{"$error":"#REF!"}},{"$f":"IF(#REF!=\"\",\"\",\"X\")","v":{"$error":"#REF!"}}]
[null,null,null,null,null,null,null,null,null,null,null,null,null,null,null,{"$f":"IF(#REF!=\"\",\"\",IF(#REF!<TODAY(),0,IF(#REF!<(TODAY()+365),1,\"X\")))","v":{"$error":"#REF!"}},{"$f":"IF(#REF!=\"\",\"\",\"X\")","v":{"$error":"#REF!"}}]
[null,null,null,null,null,null,null,null,null,null,null,null,null,null,null,{"$f":"IF(#REF!=\"\",\"\",IF(#REF!<TODAY(),0,IF(#REF!<(TODAY()+365),1,\"X\")))","v":{"$error":"#REF!"}},{"$f":"IF(#REF!=\"\",\"\",\"X\")","v":{"$error":"#REF!"}}]
[null,null,null,null,null,null,null,null,null,null,null,null,null,null,null,{"$f":"IF(#REF!=\"\",\"\",IF(#REF!<TODAY(),0,IF(#REF!<(TODAY()+365),1,\"X\")))","v":{"$error":"#REF!"}},{"$f":"IF(#REF!=\"\",\"\",\"X\")","v":{"$error":"#REF!"}}]
[null,null,null,null,null,null,null,null,null,null,null,null,null,null,null,{"$f":"IF(#REF!=\"\",\"\",IF(#REF!<TODAY(),0,IF(#REF!<(TODAY()+365),1,\"X\")))","v":{"$error":"#REF!"}},{"$f":"IF(#REF!=\"\",\"\",\"X\")","v":{"$error":"#REF!"}}]
[null,null,null,null,null,null,null,null,null,null,null,null,null,null,null,{"$f":"IF(#REF!=\"\",\"\",IF(#REF!<TODAY(),0,IF(#REF!<(TODAY()+365),1,\"X\")))","v":{"$error":"#REF!"}},{"$f":"IF(#REF!=\"\",\"\",\"X\")","v":{"$error":"#REF!"}}]
[null,null,null,null,null,null,null,null,null,null,null,null,null,null,null,{"$f":"IF(#REF!=\"\",\"\",IF(#REF!<TODAY(),0,IF(#REF!<(TODAY()+365),1,\"X\")))","v":{"$error":"#REF!"}},{"$f":"IF(#REF!=\"\",\"\",\"X\")","v":{"$error":"#REF!"}}]
[null,null,null,null,null,null,null,null,null,null,null,null,null,null,null,{"$f":"IF(#REF!=\"\",\"\",IF(#REF!<TODAY(),0,IF(#REF!<(TODAY()+365),1,\"X\")))","v":{"$error":"#REF!"}},{"$f":"IF(#REF!=\"\",\"\",\"X\")","v":{"$error":"#REF!"}}]
[null,null,null,null,null,null,null,null,null,null,null,null,null,null,null,{"$f":"IF(#REF!=\"\",\"\",IF(#REF!<TODAY(),0,IF(#REF!<(TODAY()+365),1,\"X\")))","v":{"$error":"#REF!"}},{"$f":"IF(#REF!=\"\",\"\",\"X\")","v":{"$error":"#REF!"}}]
[null,null,null,null,null,null,null,null,null,null,null,null,null,null,null,{"$f":"IF(#REF!=\"\",\"\",IF(#REF!<TODAY(),0,IF(#REF!<(TODAY()+365),1,\"X\")))","v":{"$error":"#REF!"}},{"$f":"IF(#REF!=\"\",\"\",\"X\")","v":{"$error":"#REF!"}}]
[null,null,null,null,null,null,null,null,null,null,null,null,null,null,null,{"$f":"IF(#REF!=\"\",\"\",IF(#REF!<TODAY(),0,IF(#REF!<(TODAY()+365),1,\"X\")))","v":{"$error":"#REF!"}},{"$f":"IF(#REF!=\"\",\"\",\"X\")","v":{"$error":"#REF!"}}]
[null,null,null,null,null,null,null,null,null,null,null,null,null,null,null,{"$f":"IF(#REF!=\"\",\"\",IF(#REF!<TODAY(),0,IF(#REF!<(TODAY()+365),1,\"X\")))","v":{"$error":"#REF!"}},{"$f":"IF(#REF!=\"\",\"\",\"X\")","v":{"$error":"#REF!"}}]
[null,null,null,null,null,null,null,null,null,null,null,null,null,null,null,{"$f":"IF(#REF!=\"\",\"\",IF(#REF!<TODAY(),0,IF(#REF!<(TODAY()+365),1,\"X\")))","v":{"$error":"#REF!"}},{"$f":"IF(#REF!=\"\",\"\",\"X\")","v":{"$error":"#REF!"}}]
[null,null,null,null,null,null,null,null,null,null,null,null,null,null,null,{"$f":"IF(#REF!=\"\",\"\",IF(#REF!<TODAY(),0,IF(#REF!<(TODAY()+365),1,\"X\")))","v":{"$error":"#REF!"}},{"$f":"IF(#REF!=\"\",\"\",\"X\")","v":{"$error":"#REF!"}}]
[null,null,null,null,null,null,null,null,null,null,null,null,null,null,null,{"$f":"IF(#REF!=\"\",\"\",IF(#REF!<TODAY(),0,IF(#REF!<(TODAY()+365),1,\"X\")))","v":{"$error":"#REF!"}},{"$f":"IF(#REF!=\"\",\"\",\"X\")","v":{"$error":"#REF!"}}]
[null,null,null,null,null,null,null,null,null,null,null,null,null,null,null,{"$f":"IF(#REF!=\"\",\"\",IF(#REF!<TODAY(),0,IF(#REF!<(TODAY()+365),1,\"X\")))","v":{"$error":"#REF!"}},{"$f":"IF(#REF!=\"\",\"\",\"X\")","v":{"$error":"#REF!"}}]
[null,null,null,null,null,null,null,null,null,null,null,null,null,null,null,{"$f":"IF(#REF!=\"\",\"\",IF(#REF!<TODAY(),0,IF(#REF!<(TODAY()+365),1,\"X\")))","v":{"$error":"#REF!"}},{"$f":"IF(#REF!=\"\",\"\",\"X\")","v":{"$error":"#REF!"}}]
[null,null,null,null,null,null,null,null,null,null,null,null,null,null,null,{"$f":"IF(#REF!=\"\",\"\",IF(#REF!<TODAY(),0,IF(#REF!<(TODAY()+365),1,\"X\")))","v":{"$error":"#REF!"}},{"$f":"IF(#REF!=\"\",\"\",\"X\")","v":{"$error":"#REF!"}}]
[null,null,null,null,null,null,null,null,null,null,null,null,null,null,null,{"$f":"IF(#REF!=\"\",\"\",IF(#REF!<TODAY(),0,IF(#REF!<(TODAY()+365),1,\"X\")))","v":{"$error":"#REF!"}},{"$f":"IF(#REF!=\"\",\"\",\"X\")","v":{"$error":"#REF!"}}]
[null,null,null,null,null,null,null,null,null,null,null,null,null,null,null,{"$f":"IF(#REF!=\"\",\"\",IF(#REF!<TODAY(),0,IF(#REF!<(TODAY()+365),1,\"X\")))","v":{"$error":"#REF!"}},{"$f":"IF(#REF!=\"\",\"\",\"X\")","v":{"$error":"#REF!"}}]
[null,null,null,null,null,null,null,null,null,null,null,null,null,null,null,{"$f":"IF(#REF!=\"\",\"\",IF(#REF!<TODAY(),0,IF(#REF!<(TODAY()+365),1,\"X\")))","v":{"$error":"#REF!"}},{"$f":"IF(#REF!=\"\",\"\",\"X\")","v":{"$error":"#REF!"}}]
[null,null,null,null,null,null,null,null,null,null,null,null,null,null,null,{"$f":"IF(#REF!=\"\",\"\",IF(#REF!<TODAY(),0,IF(#REF!<(TODAY()+365),1,\"X\")))","v":{"$error":"#REF!"}},{"$f":"IF(#REF!=\"\",\"\",\"X\")","v":{"$error":"#REF!"}}]
[null,null,null,null,null,null,null,null,null,null,null,null,null,null,null,{"$f":"IF(#REF!=\"\",\"\",IF(#REF!<TODAY(),0,IF(#REF!<(TODAY()+365),1,\"X\")))","v":{"$error":"#REF!"}},{"$f":"IF(#REF!=\"\",\"\",\"X\")","v":{"$error":"#REF!"}}]
[null,null,null,null,null,null,null,null,null,null,null,null,null,null,null,{"$f":"IF(#REF!=\"\",\"\",IF(#REF!<TODAY(),0,IF(#REF!<(TODAY()+365),1,\"X\")))","v":{"$error":"#REF!"}},{"$f":"IF(#REF!=\"\",\"\",\"X\")","v":{"$error":"#REF!"}}]
[null,null,null,null,null,null,null,null,null,null,null,null,null,null,null,{"$f":"IF(#REF!=\"\",\"\",IF(#REF!<TODAY(),0,IF(#REF!<(TODAY()+365),1,\"X\")))","v":{"$error":"#REF!"}},{"$f":"IF(#REF!=\"\",\"\",\"X\")","v":{"$error":"#REF!"}}]
[null,null,null,null,null,null,null,null,null,null,null,null,null,null,null,{"$f":"IF(#REF!=\"\",\"\",IF(#REF!<TODAY(),0,IF(#REF!<(TODAY()+365),1,\"X\")))","v":{"$error":"#REF!"}},{"$f":"IF(#REF!=\"\",\"\",\"X\")","v":{"$error":"#REF!"}}]
[null,null,null,null,null,null,null,null,null,null,null,null,null,null,null,{"$f":"IF(#REF!=\"\",\"\",IF(#REF!<TODAY(),0,IF(#REF!<(TODAY()+365),1,\"X\")))","v":{"$error":"#REF!"}},{"$f":"IF(#REF!=\"\",\"\",\"X\")","v":{"$error":"#REF!"}}]
[null,null,null,null,null,null,null,null,null,null,null,null,null,null,null,{"$f":"IF(#REF!=\"\",\"\",IF(#REF!<TODAY(),0,IF(#REF!<(TODAY()+365),1,\"X\")))","v":{"$error":"#REF!"}},{"$f":"IF(#REF!=\"\",\"\",\"X\")","v":{"$error":"#REF!"}}]
[null,null,null,null,null,null,null,null,null,null,null,null,null,null,null,{"$f":"IF(#REF!=\"\",\"\",IF(#REF!<TODAY(),0,IF(#REF!<(TODAY()+365),1,\"X\")))","v":{"$error":"#REF!"}},{"$f":"IF(#REF!=\"\",\"\",\"X\")","v":{"$error":"#REF!"}}]
[null,null,null,null,null,null,null,null,null,null,null,null,null,null,null,{"$f":"IF(#REF!=\"\",\"\",IF(#REF!<TODAY(),0,IF(#REF!<(TODAY()+365),1,\"X\")))","v":{"$error":"#REF!"}},{"$f":"IF(#REF!=\"\",\"\",\"X\")","v":{"$error":"#REF!"}}]
[null,null,null,null,null,null,null,null,null,null,null,null,null,null,null,{"$f":"IF(#REF!=\"\",\"\",IF(#REF!<TODAY(),0,IF(#REF!<(TODAY()+365),1,\"X\")))","v":{"$error":"#REF!"}},{"$f":"IF(#REF!=\"\",\"\",\"X\")","v":{"$error":"#REF!"}}]
[null,null,null,null,null,null,null,null,null,null,null,null,null,null,null,{"$f":"IF(#REF!=\"\",\"\",IF(#REF!<TODAY(),0,IF(#REF!<(TODAY()+365),1,\"X\")))","v":{"$error":"#REF!"}},{"$f":"IF(#REF!=\"\",\"\",\"X\")","v":{"$error":"#REF!"}}]
[null,null,null,null,null,null,null,null,null,null,null,null,null,null,null,{"$f":"IF(#REF!=\"\",\"\",IF(#REF!<TODAY(),0,IF(#REF!<(TODAY()+365),1,\"X\")))","v":{"$error":"#REF!"}},{"$f":"IF(#REF!=\"\",\"\",\"X\")","v":{"$error":"#REF!"}}]
[null,null,null,null,null,null,null,null,null,null,null,null,null,null,null,{"$f":"IF(#REF!=\"\",\"\",IF(#REF!<TODAY(),0,IF(#REF!<(TODAY()+365),1,\"X\")))","v":{"$error":"#REF!"}},{"$f":"IF(#REF!=\"\",\"\",\"X\")","v":{"$error":"#REF!"}}]
[null,null,null,null,null,null,null,null,null,null,null,null,null,null,null,{"$f":"IF(#REF!=\"\",\"\",IF(#REF!<TODAY(),0,IF(#REF!<(TODAY()+365),1,\"X\")))","v":{"$error":"#REF!"}},{"$f":"IF(#REF!=\"\",\"\",\"X\")","v":{"$error":"#REF!"}}]
[null,null,null,null,null,null,null,null,null,null,null,null,null,null,null,{"$f":"IF(#REF!=\"\",\"\",IF(#REF!<TODAY(),0,IF(#REF!<(TODAY()+365),1,\"X\")))","v":{"$error":"#REF!"}},{"$f":"IF(#REF!=\"\",\"\",\"X\")","v":{"$error":"#REF!"}}]
[null,null,null,null,null,null,null,null,null,null,null,null,null,null,null,{"$f":"IF(#REF!=\"\",\"\",IF(#REF!<TODAY(),0,IF(#REF!<(TODAY()+365),1,\"X\")))","v":{"$error":"#REF!"}},{"$f":"IF(#REF!=\"\",\"\",\"X\")","v":{"$error":"#REF!"}}]
[null,null,null,null,null,null,null,null,null,null,null,null,null,null,null,{"$f":"IF(#REF!=\"\",\"\",IF(#REF!<TODAY(),0,IF(#REF!<(TODAY()+365),1,\"X\")))","v":{"$error":"#REF!"}},{"$f":"IF(#REF!=\"\",\"\",\"X\")","v":{"$error":"#REF!"}}]
[null,null,null,null,null,null,null,null,null,null,null,null,null,null,null,{"$f":"IF(#REF!=\"\",\"\",IF(#REF!<TODAY(),0,IF(#REF!<(TODAY()+365),1,\"X\")))","v":{"$error":"#REF!"}},{"$f":"IF(#REF!=\"\",\"\",\"X\")","v":{"$error":"#REF!"}}]
[null,null,null,null,null,null,null,null,null,null,null,null,null,null,null,{"$f":"IF(#REF!=\"\",\"\",IF(#REF!<TODAY(),0,IF(#REF!<(TODAY()+365),1,\"X\")))","v":{"$error":"#REF!"}},{"$f":"IF(#REF!=\"\",\"\",\"X\")","v":{"$error":"#REF!"}}]
[null,null,null,null,null,null,null,null,null,null,null,null,null,null,null,{"$f":"IF(#REF!=\"\",\"\",IF(#REF!<TODAY(),0,IF(#REF!<(TODAY()+365),1,\"X\")))","v":{"$error":"#REF!"}},{"$f":"IF(#REF!=\"\",\"\",\"X\")","v":{"$error":"#REF!"}}]
[null,null,null,null,null,null,null,null,null,null,null,null,null,null,null,{"$f":"IF(#REF!=\"\",\"\",IF(#REF!<TODAY(),0,IF(#REF!<(TODAY()+365),1,\"X\")))","v":{"$error":"#REF!"}},{"$f":"IF(#REF!=\"\",\"\",\"X\")","v":{"$error":"#REF!"}}]
[null,null,null,null,null,null,null,null,null,null,null,null,null,null,null,{"$f":"IF(#REF!=\"\",\"\",IF(#REF!<TODAY(),0,IF(#REF!<(TODAY()+365),1,\"X\")))","v":{"$error":"#REF!"}},{"$f":"IF(#REF!=\"\",\"\",\"X\")","v":{"$error":"#REF!"}}]
[null,null,null,null,null,null,null,null,null,null,null,null,null,null,null,{"$f":"IF(#REF!=\"\",\"\",IF(#REF!<TODAY(),0,IF(#REF!<(TODAY()+365),1,\"X\")))","v":{"$error":"#REF!"}},{"$f":"IF(#REF!=\"\",\"\",\"X\")","v":{"$error":"#REF!"}}]
[null,null,null,null,null,null,null,null,null,null,null,null,null,null,null,{"$f":"IF(#REF!=\"\",\"\",IF(#REF!<TODAY(),0,IF(#REF!<(TODAY()+365),1,\"X\")))","v":{"$error":"#REF!"}},{"$f":"IF(#REF!=\"\",\"\",\"X\")","v":{"$error":"#REF!"}}]
[null,null,null,null,null,null,null,null,null,null,null,null,null,null,null,{"$f":"IF(#REF!=\"\",\"\",IF(#REF!<TODAY(),0,IF(#REF!<(TODAY()+365),1,\"X\")))","v":{"$error":"#REF!"}},{"$f":"IF(#REF!=\"\",\"\",\"X\")","v":{"$error":"#REF!"}}]
[null,null,null,null,null,null,null,null,null,null,null,null,null,null,null,{"$f":"IF(#REF!=\"\",\"\",IF(#REF!<TODAY(),0,IF(#REF!<(TODAY()+365),1,\"X\")))","v":{"$error":"#REF!"}},{"$f":"IF(#REF!=\"\",\"\",\"X\")","v":{"$error":"#REF!"}}]
[null,null,null,null,null,null,null,null,null,null,null,null,null,null,null,{"$f":"IF(#REF!=\"\",\"\",IF(#REF!<TODAY(),0,IF(#REF!<(TODAY()+365),1,\"X\")))","v":{"$error":"#REF!"}},{"$f":"IF(#REF!=\"\",\"\",\"X\")","v":{"$error":"#REF!"}}]
[null,null,null,null,null,null,null,null,null,null,null,null,null,null,null,{"$f":"IF(#REF!=\"\",\"\",IF(#REF!<TODAY(),0,IF(#REF!<(TODAY()+365),1,\"X\")))","v":{"$error":"#REF!"}},{"$f":"IF(#REF!=\"\",\"\",\"X\")","v":{"$error":"#REF!"}}]
[null,null,null,null,null,null,null,null,null,null,null,null,null,null,null,{"$f":"IF(#REF!=\"\",\"\",IF(#REF!<TODAY(),0,IF(#REF!<(TODAY()+365),1,\"X\")))","v":{"$error":"#REF!"}},{"$f":"IF(#REF!=\"\",\"\",\"X\")","v":{"$error":"#REF!"}}]
[null,null,null,null,null,null,null,null,null,null,null,null,null,null,null,{"$f":"IF(#REF!=\"\",\"\",IF(#REF!<TODAY(),0,IF(#REF!<(TODAY()+365),1,\"X\")))","v":{"$error":"#REF!"}},{"$f":"IF(#REF!=\"\",\"\",\"X\")","v":{"$error":"#REF!"}}]
[null,null,null,null,null,null,null,null,null,null,null,null,null,null,null,{"$f":"IF(#REF!=\"\",\"\",IF(#REF!<TODAY(),0,IF(#REF!<(TODAY()+365),1,\"X\")))","v":{"$error":"#REF!"}},{"$f":"IF(#REF!=\"\",\"\",\"X\")","v":{"$error":"#REF!"}}]
[null,null,null,null,null,null,null,null,null,null,null,null,null,null,null,{"$f":"IF(#REF!=\"\",\"\",IF(#REF!<TODAY(),0,IF(#REF!<(TODAY()+365),1,\"X\")))","v":{"$error":"#REF!"}},{"$f":"IF(#REF!=\"\",\"\",\"X\")","v":{"$error":"#REF!"}}]
[null,null,null,null,null,null,null,null,null,null,null,null,null,null,null,{"$f":"IF(#REF!=\"\",\"\",IF(#REF!<TODAY(),0,IF(#REF!<(TODAY()+365),1,\"X\")))","v":{"$error":"#REF!"}},{"$f":"IF(#REF!=\"\",\"\",\"X\")","v":{"$error":"#REF!"}}]
[null,null,null,null,null,null,null,null,null,null,null,null,null,null,null,{"$f":"IF(#REF!=\"\",\"\",IF(#REF!<TODAY(),0,IF(#REF!<(TODAY()+365),1,\"X\")))","v":{"$error":"#REF!"}},{"$f":"IF(#REF!=\"\",\"\",\"X\")","v":{"$error":"#REF!"}}]
[null,null,null,null,null,null,null,null,null,null,null,null,null,null,null,{"$f":"IF(#REF!=\"\",\"\",IF(#REF!<TODAY(),0,IF(#REF!<(TODAY()+365),1,\"X\")))","v":{"$error":"#REF!"}},{"$f":"IF(#REF!=\"\",\"\",\"X\")","v":{"$error":"#REF!"}}]
[null,null,null,null,null,null,null,null,null,null,null,null,null,null,null,{"$f":"IF(#REF!=\"\",\"\",IF(#REF!<TODAY(),0,IF(#REF!<(TODAY()+365),1,\"X\")))","v":{"$error":"#REF!"}},{"$f":"IF(#REF!=\"\",\"\",\"X\")","v":{"$error":"#REF!"}}]
[null,null,null,null,null,null,null,null,null,null,null,null,null,null,null,{"$f":"IF(#REF!=\"\",\"\",IF(#REF!<TODAY(),0,IF(#REF!<(TODAY()+365),1,\"X\")))","v":{"$error":"#REF!"}},{"$f":"IF(#REF!=\"\",\"\",\"X\")","v":{"$error":"#REF!"}}]
[null,null,null,null,null,null,null,null,null,null,null,null,null,null,null,{"$f":"IF(#REF!=\"\",\"\",IF(#REF!<TODAY(),0,IF(#REF!<(TODAY()+365),1,\"X\")))","v":{"$error":"#REF!"}},{"$f":"IF(#REF!=\"\",\"\",\"X\")","v":{"$error":"#REF!"}}]
[null,null,null,null,null,null,null,null,null,null,null,null,null,null,null,{"$f":"IF(#REF!=\"\",\"\",IF(#REF!<TODAY(),0,IF(#REF!<(TODAY()+365),1,\"X\")))","v":{"$error":"#REF!"}},{"$f":"IF(#REF!=\"\",\"\",\"X\")","v":{"$error":"#REF!"}}]
[null,null,null,null,null,null,null,null,null,null,null,null,null,null,null,{"$f":"IF(#REF!=\"\",\"\",IF(#REF!<TODAY(),0,IF(#REF!<(TODAY()+365),1,\"X\")))","v":{"$error":"#REF!"}},{"$f":"IF(#REF!=\"\",\"\",\"X\")","v":{"$error":"#REF!"}}]
[null,null,null,null,null,null,null,null,null,null,null,null,null,null,null,{"$f":"IF(#REF!=\"\",\"\",IF(#REF!<TODAY(),0,IF(#REF!<(TODAY()+365),1,\"X\")))","v":{"$error":"#REF!"}},{"$f":"IF(#REF!=\"\",\"\",\"X\")","v":{"$error":"#REF!"}}]
[null,null,null,null,null,null,null,null,null,null,null,null,null,null,null,{"$f":"IF(#REF!=\"\",\"\",IF(#REF!<TODAY(),0,IF(#REF!<(TODAY()+365),1,\"X\")))","v":{"$error":"#REF!"}},{"$f":"IF(#REF!=\"\",\"\",\"X\")","v":{"$error":"#REF!"}}]
[null,null,null,null,null,null,null,null,null,null,null,null,null,null,null,{"$f":"IF(#REF!=\"\",\"\",IF(#REF!<TODAY(),0,IF(#REF!<(TODAY()+365),1,\"X\")))","v":{"$error":"#REF!"}},{"$f":"IF(#REF!=\"\",\"\",\"X\")","v":{"$error":"#REF!"}}]
[null,null,null,null,null,null,null,null,null,null,null,null,null,null,null,{"$f":"IF(#REF!=\"\",\"\",IF(#REF!<TODAY(),0,IF(#REF!<(TODAY()+365),1,\"X\")))","v":{"$error":"#REF!"}},{"$f":"IF(#REF!=\"\",\"\",\"X\")","v":{"$error":"#REF!"}}]
[null,null,null,null,null,null,null,null,null,null,null,null,null,null,null,{"$f":"IF(#REF!=\"\",\"\",IF(#REF!<TODAY(),0,IF(#REF!<(TODAY()+365),1,\"X\")))","v":{"$error":"#REF!"}},{"$f":"IF(#REF!=\"\",\"\",\"X\")","v":{"$error":"#REF!"}}]
[null,null,null,null,null,null,null,null,null,null,null,null,null,null,null,{"$f":"IF(#REF!=\"\",\"\",IF(#REF!<TODAY(),0,IF(#REF!<(TODAY()+365),1,\"X\")))","v":{"$error":"#REF!"}},{"$f":"IF(#REF!=\"\",\"\",\"X\")","v":{"$error":"#REF!"}}]
[null,null,null,null,null,null,null,null,null,null,null,null,null,null,null,{"$f":"IF(#REF!=\"\",\"\",IF(#REF!<TODAY(),0,IF(#REF!<(TODAY()+365),1,\"X\")))","v":{"$error":"#REF!"}},{"$f":"IF(#REF!=\"\",\"\",\"X\")","v":{"$error":"#REF!"}}]
[null,null,null,null,null,null,null,null,null,null,null,null,null,null,null,{"$f":"IF(#REF!=\"\",\"\",IF(#REF!<TODAY(),0,IF(#REF!<(TODAY()+365),1,\"X\")))","v":{"$error":"#REF!"}},{"$f":"IF(#REF!=\"\",\"\",\"X\")","v":{"$error":"#REF!"}}]
[null,null,null,null,null,null,null,null,null,null,null,null,null,null,null,{"$f":"IF(#REF!=\"\",\"\",IF(#REF!<TODAY(),0,IF(#REF!<(TODAY()+365),1,\"X\")))","v":{"$error":"#REF!"}},{"$f":"IF(#REF!=\"\",\"\",\"X\")","v":{"$error":"#REF!"}}]
[null,null,null,null,null,null,null,null,null,null,null,null,null,null,null,{"$f":"IF(#REF!=\"\",\"\",IF(#REF!<TODAY(),0,IF(#REF!<(TODAY()+365),1,\"X\")))","v":{"$error":"#REF!"}},{"$f":"IF(#REF!=\"\",\"\",\"X\")","v":{"$error":"#REF!"}}]
[null,null,null,null,null,null,null,null,null,null,null,null,null,null,null,{"$f":"IF(#REF!=\"\",\"\",IF(#REF!<TODAY(),0,IF(#REF!<(TODAY()+365),1,\"X\")))","v":{"$error":"#REF!"}},{"$f":"IF(#REF!=\"\",\"\",\"X\")","v":{"$error":"#REF!"}}]
[null,null,null,null,null,null,null,null,null,null,null,null,null,null,null,{"$f":"IF(#REF!=\"\",\"\",IF(#REF!<TODAY(),0,IF(#REF!<(TODAY()+365),1,\"X\")))","v":{"$error":"#REF!"}},{"$f":"IF(#REF!=\"\",\"\",\"X\")","v":{"$error":"#REF!"}}]
[null,null,null,null,null,null,null,null,null,null,null,null,null,null,null,{"$f":"IF(#REF!=\"\",\"\",IF(#REF!<TODAY(),0,IF(#REF!<(TODAY()+365),1,\"X\")))","v":{"$error":"#REF!"}},{"$f":"IF(#REF!=\"\",\"\",\"X\")","v":{"$error":"#REF!"}}]
[null,null,null,null,null,null,null,null,null,null,null,null,null,null,null,{"$f":"IF(#REF!=\"\",\"\",IF(#REF!<TODAY(),0,IF(#REF!<(TODAY()+365),1,\"X\")))","v":{"$error":"#REF!"}},{"$f":"IF(#REF!=\"\",\"\",\"X\")","v":{"$error":"#REF!"}}]
[null,null,null,null,null,null,null,null,null,null,null,null,null,null,null,{"$f":"IF(#REF!=\"\",\"\",IF(#REF!<TODAY(),0,IF(#REF!<(TODAY()+365),1,\"X\")))","v":{"$error":"#REF!"}},{"$f":"IF(#REF!=\"\",\"\",\"X\")","v":{"$error":"#REF!"}}]
[null,null,null,null,null,null,null,null,null,null,null,null,null,null,null,{"$f":"IF(#REF!=\"\",\"\",IF(#REF!<TODAY(),0,IF(#REF!<(TODAY()+365),1,\"X\")))","v":{"$error":"#REF!"}},{"$f":"IF(#REF!=\"\",\"\",\"X\")","v":{"$error":"#REF!"}}]
[null,null,null,null,null,null,null,null,null,null,null,null,null,null,null,{"$f":"IF(#REF!=\"\",\"\",IF(#REF!<TODAY(),0,IF(#REF!<(TODAY()+365),1,\"X\")))","v":{"$error":"#REF!"}},{"$f":"IF(#REF!=\"\",\"\",\"X\")","v":{"$error":"#REF!"}}]
[null,null,null,null,null,null,null,null,null,null,null,null,null,null,null,{"$f":"IF(#REF!=\"\",\"\",IF(#REF!<TODAY(),0,IF(#REF!<(TODAY()+365),1,\"X\")))","v":{"$error":"#REF!"}},{"$f":"IF(#REF!=\"\",\"\",\"X\")","v":{"$error":"#REF!"}}]
[null,null,null,null,null,null,null,null,null,null,null,null,null,null,null,{"$f":"IF(#REF!=\"\",\"\",IF(#REF!<TODAY(),0,IF(#REF!<(TODAY()+365),1,\"X\")))","v":{"$error":"#REF!"}},{"$f":"IF(#REF!=\"\",\"\",\"X\")","v":{"$error":"#REF!"}}]
[null,null,null,null,null,null,null,null,null,null,null,null,null,null,null,{"$f":"IF(#REF!=\"\",\"\",IF(#REF!<TODAY(),0,IF(#REF!<(TODAY()+365),1,\"X\")))","v":{"$error":"#REF!"}},{"$f":"IF(#REF!=\"\",\"\",\"X\")","v":{"$error":"#REF!"}}]
[null,null,null,null,null,null,null,null,null,null,null,null,null,null,null,{"$f":"IF(#REF!=\"\",\"\",IF(#REF!<TODAY(),0,IF(#REF!<(TODAY()+365),1,\"X\")))","v":{"$error":"#REF!"}},{"$f":"IF(#REF!=\"\",\"\",\"X\")","v":{"$error":"#REF!"}}]
[null,null,null,null,null,null,null,null,null,null,null,null,null,null,null,{"$f":"IF(#REF!=\"\",\"\",IF(#REF!<TODAY(),0,IF(#REF!<(TODAY()+365),1,\"X\")))","v":{"$error":"#REF!"}},{"$f":"IF(#REF!=\"\",\"\",\"X\")","v":{"$error":"#REF!"}}]
[null,null,null,null,null,null,null,null,null,null,null,null,null,null,null,{"$f":"IF(#REF!=\"\",\"\",IF(#REF!<TODAY(),0,IF(#REF!<(TODAY()+365),1,\"X\")))","v":{"$error":"#REF!"}},{"$f":"IF(#REF!=\"\",\"\",\"X\")","v":{"$error":"#REF!"}}]
[null,null,null,null,null,null,null,null,null,null,null,null,null,null,null,{"$f":"IF(#REF!=\"\",\"\",IF(#REF!<TODAY(),0,IF(#REF!<(TODAY()+365),1,\"X\")))","v":{"$error":"#REF!"}},{"$f":"IF(#REF!=\"\",\"\",\"X\")","v":{"$error":"#REF!"}}]
[null,null,null,null,null,null,null,null,null,null,null,null,null,null,null,{"$f":"IF(#REF!=\"\",\"\",IF(#REF!<TODAY(),0,IF(#REF!<(TODAY()+365),1,\"X\")))","v":{"$error":"#REF!"}},{"$f":"IF(#REF!=\"\",\"\",\"X\")","v":{"$error":"#REF!"}}]
[null,null,null,null,null,null,null,null,null,null,null,null,null,null,null,{"$f":"IF(#REF!=\"\",\"\",IF(#REF!<TODAY(),0,IF(#REF!<(TODAY()+365),1,\"X\")))","v":{"$error":"#REF!"}},{"$f":"IF(#REF!=\"\",\"\",\"X\")","v":{"$error":"#REF!"}}]
[null,null,null,null,null,null,null,null,null,null,null,null,null,null,null,{"$f":"IF(#REF!=\"\",\"\",IF(#REF!<TODAY(),0,IF(#REF!<(TODAY()+365),1,\"X\")))","v":{"$error":"#REF!"}},{"$f":"IF(#REF!=\"\",\"\",\"X\")","v":{"$error":"#REF!"}}]
[null,null,null,null,null,null,null,null,null,null,null,null,null,null,null,{"$f":"IF(#REF!=\"\",\"\",IF(#REF!<TODAY(),0,IF(#REF!<(TODAY()+365),1,\"X\")))","v":{"$error":"#REF!"}},{"$f":"IF(#REF!=\"\",\"\",\"X\")","v":{"$error":"#REF!"}}]
[null,null,null,null,null,null,null,null,null,null,null,null,null,null,null,{"$f":"IF(#REF!=\"\",\"\",IF(#REF!<TODAY(),0,IF(#REF!<(TODAY()+365),1,\"X\")))","v":{"$error":"#REF!"}},{"$f":"IF(#REF!=\"\",\"\",\"X\")","v":{"$error":"#REF!"}}]
[null,null,null,null,null,null,null,null,null,null,null,null,null,null,null,{"$f":"IF(#REF!=\"\",\"\",IF(#REF!<TODAY(),0,IF(#REF!<(TODAY()+365),1,\"X\")))","v":{"$error":"#REF!"}},{"$f":"IF(#REF!=\"\",\"\",\"X\")","v":{"$error":"#REF!"}}]
[null,null,null,null,null,null,null,null,null,null,null,null,null,null,null,{"$f":"IF(#REF!=\"\",\"\",IF(#REF!<TODAY(),0,IF(#REF!<(TODAY()+365),1,\"X\")))","v":{"$error":"#REF!"}},{"$f":"IF(#REF!=\"\",\"\",\"X\")","v":{"$error":"#REF!"}}]
[null,null,null,null,null,null,null,null,null,null,null,null,null,null,null,{"$f":"IF(#REF!=\"\",\"\",IF(#REF!<TODAY(),0,IF(#REF!<(TODAY()+365),1,\"X\")))","v":{"$error":"#REF!"}},{"$f":"IF(#REF!=\"\",\"\",\"X\")","v":{"$error":"#REF!"}}]
[null,null,null,null,null,null,null,null,null,null,null,null,null,null,null,{"$f":"IF(#REF!=\"\",\"\",IF(#REF!<TODAY(),0,IF(#REF!<(TODAY()+365),1,\"X\")))","v":{"$error":"#REF!"}},{"$f":"IF(#REF!=\"\",\"\",\"X\")","v":{"$error":"#REF!"}}]
[null,null,null,null,null,null,null,null,null,null,null,null,null,null,null,{"$f":"IF(#REF!=\"\",\"\",IF(#REF!<TODAY(),0,IF(#REF!<(TODAY()+365),1,\"X\")))","v":{"$error":"#REF!"}},{"$f":"IF(#REF!=\"\",\"\",\"X\")","v":{"$error":"#REF!"}}]
[null,null,null,null,null,null,null,null,null,null,null,null,null,null,null,{"$f":"IF(#REF!=\"\",\"\",IF(#REF!<TODAY(),0,IF(#REF!<(TODAY()+365),1,\"X\")))","v":{"$error":"#REF!"}},{"$f":"IF(#REF!=\"\",\"\",\"X\")","v":{"$error":"#REF!"}}]
[null,null,null,null,null,null,null,null,null,null,null,null,null,null,null,{"$f":"IF(#REF!=\"\",\"\",IF(#REF!<TODAY(),0,IF(#REF!<(TODAY()+365),1,\"X\")))","v":{"$error":"#REF!"}},{"$f":"IF(#REF!=\"\",\"\",\"X\")","v":{"$error":"#REF!"}}]
[null,null,null,null,null,null,null,null,null,null,null,null,null,null,null,{"$f":"IF(#REF!=\"\",\"\",IF(#REF!<TODAY(),0,IF(#REF!<(TODAY()+365),1,\"X\")))","v":{"$error":"#REF!"}},{"$f":"IF(#REF!=\"\",\"\",\"X\")","v":{"$error":"#REF!"}}]
[null,null,null,null,null,null,null,null,null,null,null,null,null,null,null,{"$f":"IF(#REF!=\"\",\"\",IF(#REF!<TODAY(),0,IF(#REF!<(TODAY()+365),1,\"X\")))","v":{"$error":"#REF!"}},{"$f":"IF(#REF!=\"\",\"\",\"X\")","v":{"$error":"#REF!"}}]
[null,null,null,null,null,null,null,null,null,null,null,null,null,null,null,{"$f":"IF(#REF!=\"\",\"\",IF(#REF!<TODAY(),0,IF(#REF!<(TODAY()+365),1,\"X\")))","v":{"$error":"#REF!"}},{"$f":"IF(#REF!=\"\",\"\",\"X\")","v":{"$error":"#REF!"}}]
[null,null,null,null,null,null,null,null,null,null,null,null,null,null,null,{"$f":"IF(#REF!=\"\",\"\",IF(#REF!<TODAY(),0,IF(#REF!<(TODAY()+365),1,\"X\")))","v":{"$error":"#REF!"}},{"$f":"IF(#REF!=\"\",\"\",\"X\")","v":{"$error":"#REF!"}}]
[null,null,null,null,null,null,null,null,null,null,null,null,null,null,null,{"$f":"IF(#REF!=\"\",\"\",IF(#REF!<TODAY(),0,IF(#REF!<(TODAY()+365),1,\"X\")))","v":{"$error":"#REF!"}},{"$f":"IF(#REF!=\"\",\"\",\"X\")","v":{"$error":"#REF!"}}]
[null,null,null,null,null,null,null,null,null,null,null,null,null,null,null,{"$f":"IF(#REF!=\"\",\"\",IF(#REF!<TODAY(),0,IF(#REF!<(TODAY()+365),1,\"X\")))","v":{"$error":"#REF!"}},{"$f":"IF(#REF!=\"\",\"\",\"X\")","v":{"$error":"#REF!"}}]
[null,null,null,null,null,null,null,null,null,null,null,null,null,null,null,{"$f":"IF(#REF!=\"\",\"\",IF(#REF!<TODAY(),0,IF(#REF!<(TODAY()+365),1,\"X\")))","v":{"$error":"#REF!"}},{"$f":"IF(#REF!=\"\",\"\",\"X\")","v":{"$error":"#REF!"}}]
[null,null,null,null,null,null,null,null,null,null,null,null,null,null,null,{"$f":"IF(#REF!=\"\",\"\",IF(#REF!<TODAY(),0,IF(#REF!<(TODAY()+365),1,\"X\")))","v":{"$error":"#REF!"}},{"$f":"IF(#REF!=\"\",\"\",\"X\")","v":{"$error":"#REF!"}}]
[null,null,null,null,null,null,null,null,null,null,null,null,null,null,null,{"$f":"IF(#REF!=\"\",\"\",IF(#REF!<TODAY(),0,IF(#REF!<(TODAY()+365),1,\"X\")))","v":{"$error":"#REF!"}},{"$f":"IF(#REF!=\"\",\"\",\"X\")","v":{"$error":"#REF!"}}]
[null,null,null,null,null,null,null,null,null,null,null,null,null,null,null,{"$f":"IF(#REF!=\"\",\"\",IF(#REF!<TODAY(),0,IF(#REF!<(TODAY()+365),1,\"X\")))","v":{"$error":"#REF!"}},{"$f":"IF(#REF!=\"\",\"\",\"X\")","v":{"$error":"#REF!"}}]
[null,null,null,null,null,null,null,null,null,null,null,null,null,null,null,{"$f":"IF(#REF!=\"\",\"\",IF(#REF!<TODAY(),0,IF(#REF!<(TODAY()+365),1,\"X\")))","v":{"$error":"#REF!"}},{"$f":"IF(#REF!=\"\",\"\",\"X\")","v":{"$error":"#REF!"}}]
[null,null,null,null,null,null,null,null,null,null,null,null,null,null,null,{"$f":"IF(#REF!=\"\",\"\",IF(#REF!<TODAY(),0,IF(#REF!<(TODAY()+365),1,\"X\")))","v":{"$error":"#REF!"}},{"$f":"IF(#REF!=\"\",\"\",\"X\")","v":{"$error":"#REF!"}}]
[null,null,null,null,null,null,null,null,null,null,null,null,null,null,null,{"$f":"IF(#REF!=\"\",\"\",IF(#REF!<TODAY(),0,IF(#REF!<(TODAY()+365),1,\"X\")))","v":{"$error":"#REF!"}},{"$f":"IF(#REF!=\"\",\"\",\"X\")","v":{"$error":"#REF!"}}]
[null,null,null,null,null,null,null,null,null,null,null,null,null,null,null,{"$f":"IF(#REF!=\"\",\"\",IF(#REF!<TODAY(),0,IF(#REF!<(TODAY()+365),1,\"X\")))","v":{"$error":"#REF!"}},{"$f":"IF(#REF!=\"\",\"\",\"X\")","v":{"$error":"#REF!"}}]
[null,null,null,null,null,null,null,null,null,null,null,null,null,null,null,{"$f":"IF(#REF!=\"\",\"\",IF(#REF!<TODAY(),0,IF(#REF!<(TODAY()+365),1,\"X\")))","v":{"$error":"#REF!"}},{"$f":"IF(#REF!=\"\",\"\",\"X\")","v":{"$error":"#REF!"}}]
[null,null,null,null,null,null,null,null,null,null,null,null,null,null,null,{"$f":"IF(#REF!=\"\",\"\",IF(#REF!<TODAY(),0,IF(#REF!<(TODAY()+365),1,\"X\")))","v":{"$error":"#REF!"}},{"$f":"IF(#REF!=\"\",\"\",\"X\")","v":{"$error":"#REF!"}}]
[null,null,null,null,null,null,null,null,null,null,null,null,null,null,null,{"$f":"IF(#REF!=\"\",\"\",IF(#REF!<TODAY(),0,IF(#REF!<(TODAY()+365),1,\"X\")))","v":{"$error":"#REF!"}},{"$f":"IF(#REF!=\"\",\"\",\"X\")","v":{"$error":"#REF!"}}]
[null,null,null,null,null,null,null,null,null,null,null,null,null,null,null,{"$f":"IF(#REF!=\"\",\"\",IF(#REF!<TODAY(),0,IF(#REF!<(TODAY()+365),1,\"X\")))","v":{"$error":"#REF!"}},{"$f":"IF(#REF!=\"\",\"\",\"X\")","v":{"$error":"#REF!"}}]
[null,null,null,null,null,null,null,null,null,null,null,null,null,null,null,{"$f":"IF(#REF!=\"\",\"\",IF(#REF!<TODAY(),0,IF(#REF!<(TODAY()+365),1,\"X\")))","v":{"$error":"#REF!"}},{"$f":"IF(#REF!=\"\",\"\",\"X\")","v":{"$error":"#REF!"}}]
[null,null,null,null,null,null,null,null,null,null,null,null,null,null,null,{"$f":"IF(#REF!=\"\",\"\",IF(#REF!<TODAY(),0,IF(#REF!<(TODAY()+365),1,\"X\")))","v":{"$error":"#REF!"}},{"$f":"IF(#REF!=\"\",\"\",\"X\")","v":{"$error":"#REF!"}}]
[null,null,null,null,null,null,null,null,null,null,null,null,null,null,null,{"$f":"IF(#REF!=\"\",\"\",IF(#REF!<TODAY(),0,IF(#REF!<(TODAY()+365),1,\"X\")))","v":{"$error":"#REF!"}},{"$f":"IF(#REF!=\"\",\"\",\"X\")","v":{"$error":"#REF!"}}]
[null,null,null,null,null,null,null,null,null,null,null,null,null,null,null,{"$f":"IF(#REF!=\"\",\"\",IF(#REF!<TODAY(),0,IF(#REF!<(TODAY()+365),1,\"X\")))","v":{"$error":"#REF!"}},{"$f":"IF(#REF!=\"\",\"\",\"X\")","v":{"$error":"#REF!"}}]
[null,null,null,null,null,null,null,null,null,null,null,null,null,null,null,{"$f":"IF(#REF!=\"\",\"\",IF(#REF!<TODAY(),0,IF(#REF!<(TODAY()+365),1,\"X\")))","v":{"$error":"#REF!"}},{"$f":"IF(#REF!=\"\",\"\",\"X\")","v":{"$error":"#REF!"}}]
[null,null,null,null,null,null,null,null,null,null,null,null,null,null,null,{"$f":"IF(#REF!=\"\",\"\",IF(#REF!<TODAY(),0,IF(#REF!<(TODAY()+365),1,\"X\")))","v":{"$error":"#REF!"}},{"$f":"IF(#REF!=\"\",\"\",\"X\")","v":{"$error":"#REF!"}}]
[null,null,null,null,null,null,null,null,null,null,null,null,null,null,null,{"$f":"IF(#REF!=\"\",\"\",IF(#REF!<TODAY(),0,IF(#REF!<(TODAY()+365),1,\"X\")))","v":{"$error":"#REF!"}},{"$f":"IF(#REF!=\"\",\"\",\"X\")","v":{"$error":"#REF!"}}]
[null,null,null,null,null,null,null,null,null,null,null,null,null,null,null,{"$f":"IF(#REF!=\"\",\"\",IF(#REF!<TODAY(),0,IF(#REF!<(TODAY()+365),1,\"X\")))","v":{"$error":"#REF!"}},{"$f":"IF(#REF!=\"\",\"\",\"X\")","v":{"$error":"#REF!"}}]
[null,null,null,null,null,null,null,null,null,null,null,null,null,null,null,{"$f":"IF(#REF!=\"\",\"\",IF(#REF!<TODAY(),0,IF(#REF!<(TODAY()+365),1,\"X\")))","v":{"$error":"#REF!"}},{"$f":"IF(#REF!=\"\",\"\",\"X\")","v":{"$error":"#REF!"}}]
[null,null,null,null,null,null,null,null,null,null,null,null,null,null,null,{"$f":"IF(#REF!=\"\",\"\",IF(#REF!<TODAY(),0,IF(#REF!<(TODAY()+365),1,\"X\")))","v":{"$error":"#REF!"}},{"$f":"IF(#REF!=\"\",\"\",\"X\")","v":{"$error":"#REF!"}}]
[null,null,null,null,null,null,null,null,null,null,null,null,null,null,null,{"$f":"IF(#REF!=\"\",\"\",IF(#REF!<TODAY(),0,IF(#REF!<(TODAY()+365),1,\"X\")))","v":{"$error":"#REF!"}},{"$f":"IF(#REF!=\"\",\"\",\"X\")","v":{"$error":"#REF!"}}]
[null,null,null,null,null,null,null,null,null,null,null,null,null,null,null,{"$f":"IF(#REF!=\"\",\"\",IF(#REF!<TODAY(),0,IF(#REF!<(TODAY()+365),1,\"X\")))","v":{"$error":"#REF!"}},{"$f":"IF(#REF!=\"\",\"\",\"X\")","v":{"$error":"#REF!"}}]
[null,null,null,null,null,null,null,null,null,null,null,null,null,null,null,{"$f":"IF(#REF!=\"\",\"\",IF(#REF!<TODAY(),0,IF(#REF!<(TODAY()+365),1,\"X\")))","v":{"$error":"#REF!"}},{"$f":"IF(#REF!=\"\",\"\",\"X\")","v":{"$error":"#REF!"}}]
[null,null,null,null,null,null,null,null,null,null,null,null,null,null,null,{"$f":"IF(#REF!=\"\",\"\",IF(#REF!<TODAY(),0,IF(#REF!<(TODAY()+365),1,\"X\")))","v":{"$error":"#REF!"}},{"$f":"IF(#REF!=\"\",\"\",\"X\")","v":{"$error":"#REF!"}}]
[null,null,null,null,null,null,null,null,null,null,null,null,null,null,null,{"$f":"IF(#REF!=\"\",\"\",IF(#REF!<TODAY(),0,IF(#REF!<(TODAY()+365),1,\"X\")))","v":{"$error":"#REF!"}},{"$f":"IF(#REF!=\"\",\"\",\"X\")","v":{"$error":"#REF!"}}]
[null,null,null,null,null,null,null,null,null,null,null,null,null,null,null,{"$f":"IF(#REF!=\"\",\"\",IF(#REF!<TODAY(),0,IF(#REF!<(TODAY()+365),1,\"X\")))","v":{"$error":"#REF!"}},{"$f":"IF(#REF!=\"\",\"\",\"X\")","v":{"$error":"#REF!"}}]
[null,null,null,null,null,null,null,null,null,null,null,null,null,null,null,{"$f":"IF(#REF!=\"\",\"\",IF(#REF!<TODAY(),0,IF(#REF!<(TODAY()+365),1,\"X\")))","v":{"$error":"#REF!"}},{"$f":"IF(#REF!=\"\",\"\",\"X\")","v":{"$error":"#REF!"}}]
[null,null,null,null,null,null,null,null,null,null,null,null,null,null,null,{"$f":"IF(#REF!=\"\",\"\",IF(#REF!<TODAY(),0,IF(#REF!<(TODAY()+365),1,\"X\")))","v":{"$error":"#REF!"}},{"$f":"IF(#REF!=\"\",\"\",\"X\")","v":{"$error":"#REF!"}}]
[null,null,null,null,null,null,null,null,null,null,null,null,null,null,null,{"$f":"IF(#REF!=\"\",\"\",IF(#REF!<TODAY(),0,IF(#REF!<(TODAY()+365),1,\"X\")))","v":{"$error":"#REF!"}},{"$f":"IF(#REF!=\"\",\"\",\"X\")","v":{"$error":"#REF!"}}]
[null,null,null,null,null,null,null,null,null,null,null,null,null,null,null,{"$f":"IF(#REF!=\"\",\"\",IF(#REF!<TODAY(),0,IF(#REF!<(TODAY()+365),1,\"X\")))","v":{"$error":"#REF!"}},{"$f":"IF(#REF!=\"\",\"\",\"X\")","v":{"$error":"#REF!"}}]
[null,null,null,null,null,null,null,null,null,null,null,null,null,null,null,{"$f":"IF(#REF!=\"\",\"\",IF(#REF!<TODAY(),0,IF(#REF!<(TODAY()+365),1,\"X\")))","v":{"$error":"#REF!"}},{"$f":"IF(#REF!=\"\",\"\",\"X\")","v":{"$error":"#REF!"}}]
[null,null,null,null,null,null,null,null,null,null,null,null,null,null,null,{"$f":"IF(#REF!=\"\",\"\",IF(#REF!<TODAY(),0,IF(#REF!<(TODAY()+365),1,\"X\")))","v":{"$error":"#REF!"}},{"$f":"IF(#REF!=\"\",\"\",\"X\")","v":{"$error":"#REF!"}}]
[null,null,null,null,null,null,null,null,null,null,null,null,null,null,null,{"$f":"IF(#REF!=\"\",\"\",IF(#REF!<TODAY(),0,IF(#REF!<(TODAY()+365),1,\"X\")))","v":{"$error":"#REF!"}},{"$f":"IF(#REF!=\"\",\"\",\"X\")","v":{"$error":"#REF!"}}]
[null,null,null,null,null,null,null,null,null,null,null,null,null,null,null,{"$f":"IF(#REF!=\"\",\"\",IF(#REF!<TODAY(),0,IF(#REF!<(TODAY()+365),1,\"X\")))","v":{"$error":"#REF!"}},{"$f":"IF(#REF!=\"\",\"\",\"X\")","v":{"$error":"#REF!"}}]
[null,null,null,null,null,null,null,null,null,null,null,null,null,null,null,{"$f":"IF(#REF!=\"\",\"\",IF(#REF!<TODAY(),0,IF(#REF!<(TODAY()+365),1,\"X\")))","v":{"$error":"#REF!"}},{"$f":"IF(#REF!=\"\",\"\",\"X\")","v":{"$error":"#REF!"}}]
[null,null,null,null,null,null,null,null,null,null,null,null,null,null,null,{"$f":"IF(#REF!=\"\",\"\",IF(#REF!<TODAY(),0,IF(#REF!<(TODAY()+365),1,\"X\")))","v":{"$error":"#REF!"}},{"$f":"IF(#REF!=\"\",\"\",\"X\")","v":{"$error":"#REF!"}}]
[null,null,null,null,null,null,null,null,null,null,null,null,null,null,null,{"$f":"IF(#REF!=\"\",\"\",IF(#REF!<TODAY(),0,IF(#REF!<(TODAY()+365),1,\"X\")))","v":{"$error":"#REF!"}},{"$f":"IF(#REF!=\"\",\"\",\"X\")","v":{"$error":"#REF!"}}]
[null,null,null,null,null,null,null,null,null,null,null,null,null,null,null,{"$f":"IF(#REF!=\"\",\"\",IF(#REF!<TODAY(),0,IF(#REF!<(TODAY()+365),1,\"X\")))","v":{"$error":"#REF!"}},{"$f":"IF(#REF!=\"\",\"\",\"X\")","v":{"$error":"#REF!"}}]
[null,null,null,null,null,null,null,null,null,null,null,null,null,null,null,{"$f":"IF(#REF!=\"\",\"\",IF(#REF!<TODAY(),0,IF(#REF!<(TODAY()+365),1,\"X\")))","v":{"$error":"#REF!"}},{"$f":"IF(#REF!=\"\",\"\",\"X\")","v":{"$error":"#REF!"}}]
[null,null,null,null,null,null,null,null,null,null,null,null,null,null,null,{"$f":"IF(#REF!=\"\",\"\",IF(#REF!<TODAY(),0,IF(#REF!<(TODAY()+365),1,\"X\")))","v":{"$error":"#REF!"}},{"$f":"IF(#REF!=\"\",\"\",\"X\")","v":{"$error":"#REF!"}}]
[null,null,null,null,null,null,null,null,null,null,null,null,null,null,null,{"$f":"IF(#REF!=\"\",\"\",IF(#REF!<TODAY(),0,IF(#REF!<(TODAY()+365),1,\"X\")))","v":{"$error":"#REF!"}},{"$f":"IF(#REF!=\"\",\"\",\"X\")","v":{"$error":"#REF!"}}]
[null,null,null,null,null,null,null,null,null,null,null,null,null,null,null,{"$f":"IF(#REF!=\"\",\"\",IF(#REF!<TODAY(),0,IF(#REF!<(TODAY()+365),1,\"X\")))","v":{"$error":"#REF!"}},{"$f":"IF(#REF!=\"\",\"\",\"X\")","v":{"$error":"#REF!"}}]
[null,null,null,null,null,null,null,null,null,null,null,null,null,null,null,{"$f":"IF(#REF!=\"\",\"\",IF(#REF!<TODAY(),0,IF(#REF!<(TODAY()+365),1,\"X\")))","v":{"$error":"#REF!"}},{"$f":"IF(#REF!=\"\",\"\",\"X\")","v":{"$error":"#REF!"}}]
[null,null,null,null,null,null,null,null,null,null,null,null,null,null,null,{"$f":"IF(#REF!=\"\",\"\",IF(#REF!<TODAY(),0,IF(#REF!<(TODAY()+365),1,\"X\")))","v":{"$error":"#REF!"}},{"$f":"IF(#REF!=\"\",\"\",\"X\")","v":{"$error":"#REF!"}}]
[null,null,null,null,null,null,null,null,null,null,null,null,null,null,null,{"$f":"IF(#REF!=\"\",\"\",IF(#REF!<TODAY(),0,IF(#REF!<(TODAY()+365),1,\"X\")))","v":{"$error":"#REF!"}},{"$f":"IF(#REF!=\"\",\"\",\"X\")","v":{"$error":"#REF!"}}]
[null,null,null,null,null,null,null,null,null,null,null,null,null,null,null,{"$f":"IF(#REF!=\"\",\"\",IF(#REF!<TODAY(),0,IF(#REF!<(TODAY()+365),1,\"X\")))","v":{"$error":"#REF!"}},{"$f":"IF(#REF!=\"\",\"\",\"X\")","v":{"$error":"#REF!"}}]
[null,null,null,null,null,null,null,null,null,null,null,null,null,null,null,{"$f":"IF(#REF!=\"\",\"\",IF(#REF!<TODAY(),0,IF(#REF!<(TODAY()+365),1,\"X\")))","v":{"$error":"#REF!"}},{"$f":"IF(#REF!=\"\",\"\",\"X\")","v":{"$error":"#REF!"}}]
[null,null,null,null,null,null,null,null,null,null,null,null,null,null,null,{"$f":"IF(#REF!=\"\",\"\",IF(#REF!<TODAY(),0,IF(#REF!<(TODAY()+365),1,\"X\")))","v":{"$error":"#REF!"}},{"$f":"IF(#REF!=\"\",\"\",\"X\")","v":{"$error":"#REF!"}}]
[null,null,null,null,null,null,null,null,null,null,null,null,null,null,null,{"$f":"IF(#REF!=\"\",\"\",IF(#REF!<TODAY(),0,IF(#REF!<(TODAY()+365),1,\"X\")))","v":{"$error":"#REF!"}},{"$f":"IF(#REF!=\"\",\"\",\"X\")","v":{"$error":"#REF!"}}]
[null,null,null,null,null,null,null,null,null,null,null,null,null,null,null,{"$f":"IF(#REF!=\"\",\"\",IF(#REF!<TODAY(),0,IF(#REF!<(TODAY()+365),1,\"X\")))","v":{"$error":"#REF!"}},{"$f":"IF(#REF!=\"\",\"\",\"X\")","v":{"$error":"#REF!"}}]
[null,null,null,null,null,null,null,null,null,null,null,null,null,null,null,{"$f":"IF(#REF!=\"\",\"\",IF(#REF!<TODAY(),0,IF(#REF!<(TODAY()+365),1,\"X\")))","v":{"$error":"#REF!"}},{"$f":"IF(#REF!=\"\",\"\",\"X\")","v":{"$error":"#REF!"}}]
[null,null,null,null,null,null,null,null,null,null,null,null,null,null,null,{"$f":"IF(#REF!=\"\",\"\",IF(#REF!<TODAY(),0,IF(#REF!<(TODAY()+365),1,\"X\")))","v":{"$error":"#REF!"}},{"$f":"IF(#REF!=\"\",\"\",\"X\")","v":{"$error":"#REF!"}}]
[null,null,null,null,null,null,null,null,null,null,null,null,null,null,null,{"$f":"IF(#REF!=\"\",\"\",IF(#REF!<TODAY(),0,IF(#REF!<(TODAY()+365),1,\"X\")))","v":{"$error":"#REF!"}},{"$f":"IF(#REF!=\"\",\"\",\"X\")","v":{"$error":"#REF!"}}]
[null,null,null,null,null,null,null,null,null,null,null,null,null,null,null,{"$f":"IF(#REF!=\"\",\"\",IF(#REF!<TODAY(),0,IF(#REF!<(TODAY()+365),1,\"X\")))","v":{"$error":"#REF!"}},{"$f":"IF(#REF!=\"\",\"\",\"X\")","v":{"$error":"#REF!"}}]
[null,null,null,null,null,null,null,null,null,null,null,null,null,null,null,{"$f":"IF(#REF!=\"\",\"\",IF(#REF!<TODAY(),0,IF(#REF!<(TODAY()+365),1,\"X\")))","v":{"$error":"#REF!"}},{"$f":"IF(#REF!=\"\",\"\",\"X\")","v":{"$error":"#REF!"}}]
[null,null,null,null,null,null,null,null,null,null,null,null,null,null,null,{"$f":"IF(#REF!=\"\",\"\",IF(#REF!<TODAY(),0,IF(#REF!<(TODAY()+365),1,\"X\")))","v":{"$error":"#REF!"}},{"$f":"IF(#REF!=\"\",\"\",\"X\")","v":{"$error":"#REF!"}}]
[null,null,null,null,null,null,null,null,null,null,null,null,null,null,null,{"$f":"IF(#REF!=\"\",\"\",IF(#REF!<TODAY(),0,IF(#REF!<(TODAY()+365),1,\"X\")))","v":{"$error":"#REF!"}},{"$f":"IF(#REF!=\"\",\"\",\"X\")","v":{"$error":"#REF!"}}]
[null,null,null,null,null,null,null,null,null,null,null,null,null,null,null,{"$f":"IF(#REF!=\"\",\"\",IF(#REF!<TODAY(),0,IF(#REF!<(TODAY()+365),1,\"X\")))","v":{"$error":"#REF!"}},{"$f":"IF(#REF!=\"\",\"\",\"X\")","v":{"$error":"#REF!"}}]
[null,null,null,null,null,null,null,null,null,null,null,null,null,null,null,{"$f":"IF(#REF!=\"\",\"\",IF(#REF!<TODAY(),0,IF(#REF!<(TODAY()+365),1,\"X\")))","v":{"$error":"#REF!"}},{"$f":"IF(#REF!=\"\",\"\",\"X\")","v":{"$error":"#REF!"}}]
[null,null,null,null,null,null,null,null,null,null,null,null,null,null,null,{"$f":"IF(#REF!=\"\",\"\",IF(#REF!<TODAY(),0,IF(#REF!<(TODAY()+365),1,\"X\")))","v":{"$error":"#REF!"}},{"$f":"IF(#REF!=\"\",\"\",\"X\")","v":{"$error":"#REF!"}}]
[null,null,null,null,null,null,null,null,null,null,null,null,null,null,null,{"$f":"IF(#REF!=\"\",\"\",IF(#REF!<TODAY(),0,IF(#REF!<(TODAY()+365),1,\"X\")))","v":{"$error":"#REF!"}},{"$f":"IF(#REF!=\"\",\"\",\"X\")","v":{"$error":"#REF!"}}]
[null,null,null,null,null,null,null,null,null,null,null,null,null,null,null,{"$f":"IF(#REF!=\"\",\"\",IF(#REF!<TODAY(),0,IF(#REF!<(TODAY()+365),1,\"X\")))","v":{"$error":"#REF!"}},{"$f":"IF(#REF!=\"\",\"\",\"X\")","v":{"$error":"#REF!"}}]
[null,null,null,null,null,null,null,null,null,null,null,null,null,null,null,{"$f":"IF(#REF!=\"\",\"\",IF(#REF!<TODAY(),0,IF(#REF!<(TODAY()+365),1,\"X\")))","v":{"$error":"#REF!"}},{"$f":"IF(#REF!=\"\",\"\",\"X\")","v":{"$error":"#REF!"}}]
[null,null,null,null,null,null,null,null,null,null,null,null,null,null,null,{"$f":"IF(#REF!=\"\",\"\",IF(#REF!<TODAY(),0,IF(#REF!<(TODAY()+365),1,\"X\")))","v":{"$error":"#REF!"}},{"$f":"IF(#REF!=\"\",\"\",\"X\")","v":{"$error":"#REF!"}}]
[null,null,null,null,null,null,null,null,null,null,null,null,null,null,null,{"$f":"IF(#REF!=\"\",\"\",IF(#REF!<TODAY(),0,IF(#REF!<(TODAY()+365),1,\"X\")))","v":{"$error":"#REF!"}},{"$f":"IF(#REF!=\"\",\"\",\"X\")","v":{"$error":"#REF!"}}]
[null,null,null,null,null,null,null,null,null,null,null,null,null,null,null,{"$f":"IF(#REF!=\"\",\"\",IF(#REF!<TODAY(),0,IF(#REF!<(TODAY()+365),1,\"X\")))","v":{"$error":"#REF!"}},{"$f":"IF(#REF!=\"\",\"\",\"X\")","v":{"$error":"#REF!"}}]
[null,null,null,null,null,null,null,null,null,null,null,null,null,null,null,{"$f":"IF(#REF!=\"\",\"\",IF(#REF!<TODAY(),0,IF(#REF!<(TODAY()+365),1,\"X\")))","v":{"$error":"#REF!"}},{"$f":"IF(#REF!=\"\",\"\",\"X\")","v":{"$error":"#REF!"}}]
[null,null,null,null,null,null,null,null,null,null,null,null,null,null,null,{"$f":"IF(#REF!=\"\",\"\",IF(#REF!<TODAY(),0,IF(#REF!<(TODAY()+365),1,\"X\")))","v":{"$error":"#REF!"}},{"$f":"IF(#REF!=\"\",\"\",\"X\")","v":{"$error":"#REF!"}}]
[null,null,null,null,null,null,null,null,null,null,null,null,null,null,null,{"$f":"IF(#REF!=\"\",\"\",IF(#REF!<TODAY(),0,IF(#REF!<(TODAY()+365),1,\"X\")))","v":{"$error":"#REF!"}},{"$f":"IF(#REF!=\"\",\"\",\"X\")","v":{"$error":"#REF!"}}]
[null,null,null,null,null,null,null,null,null,null,null,null,null,null,null,{"$f":"IF(#REF!=\"\",\"\",IF(#REF!<TODAY(),0,IF(#REF!<(TODAY()+365),1,\"X\")))","v":{"$error":"#REF!"}},{"$f":"IF(#REF!=\"\",\"\",\"X\")","v":{"$error":"#REF!"}}]
[null,null,null,null,null,null,null,null,null,null,null,null,null,null,null,{"$f":"IF(#REF!=\"\",\"\",IF(#REF!<TODAY(),0,IF(#REF!<(TODAY()+365),1,\"X\")))","v":{"$error":"#REF!"}},{"$f":"IF(#REF!=\"\",\"\",\"X\")","v":{"$error":"#REF!"}}]
[null,null,null,null,null,null,null,null,null,null,null,null,null,null,null,{"$f":"IF(#REF!=\"\",\"\",IF(#REF!<TODAY(),0,IF(#REF!<(TODAY()+365),1,\"X\")))","v":{"$error":"#REF!"}},{"$f":"IF(#REF!=\"\",\"\",\"X\")","v":{"$error":"#REF!"}}]
[null,null,null,null,null,null,null,null,null,null,null,null,null,null,null,{"$f":"IF(#REF!=\"\",\"\",IF(#REF!<TODAY(),0,IF(#REF!<(TODAY()+365),1,\"X\")))","v":{"$error":"#REF!"}},{"$f":"IF(#REF!=\"\",\"\",\"X\")","v":{"$error":"#REF!"}}]
[null,null,null,null,null,null,null,null,null,null,null,null,null,null,null,{"$f":"IF(#REF!=\"\",\"\",IF(#REF!<TODAY(),0,IF(#REF!<(TODAY()+365),1,\"X\")))","v":{"$error":"#REF!"}},{"$f":"IF(#REF!=\"\",\"\",\"X\")","v":{"$error":"#REF!"}}]
[null,null,null,null,null,null,null,null,null,null,null,null,null,null,null,{"$f":"IF(#REF!=\"\",\"\",IF(#REF!<TODAY(),0,IF(#REF!<(TODAY()+365),1,\"X\")))","v":{"$error":"#REF!"}},{"$f":"IF(#REF!=\"\",\"\",\"X\")","v":{"$error":"#REF!"}}]
[null,null,null,null,null,null,null,null,null,null,null,null,null,null,null,{"$f":"IF(#REF!=\"\",\"\",IF(#REF!<TODAY(),0,IF(#REF!<(TODAY()+365),1,\"X\")))","v":{"$error":"#REF!"}},{"$f":"IF(#REF!=\"\",\"\",\"X\")","v":{"$error":"#REF!"}}]
[null,null,null,null,null,null,null,null,null,null,null,null,null,null,null,{"$f":"IF(#REF!=\"\",\"\",IF(#REF!<TODAY(),0,IF(#REF!<(TODAY()+365),1,\"X\")))","v":{"$error":"#REF!"}},{"$f":"IF(#REF!=\"\",\"\",\"X\")","v":{"$error":"#REF!"}}]
[null,null,null,null,null,null,null,null,null,null,null,null,null,null,null,{"$f":"IF(#REF!=\"\",\"\",IF(#REF!<TODAY(),0,IF(#REF!<(TODAY()+365),1,\"X\")))","v":{"$error":"#REF!"}},{"$f":"IF(#REF!=\"\",\"\",\"X\")","v":{"$error":"#REF!"}}]
[null,null,null,null,null,null,null,null,null,null,null,null,null,null,null,{"$f":"IF(#REF!=\"\",\"\",IF(#REF!<TODAY(),0,IF(#REF!<(TODAY()+365),1,\"X\")))","v":{"$error":"#REF!"}},{"$f":"IF(#REF!=\"\",\"\",\"X\")","v":{"$error":"#REF!"}}]
[null,null,null,null,null,null,null,null,null,null,null,null,null,null,null,{"$f":"IF(#REF!=\"\",\"\",IF(#REF!<TODAY(),0,IF(#REF!<(TODAY()+365),1,\"X\")))","v":{"$error":"#REF!"}},{"$f":"IF(#REF!=\"\",\"\",\"X\")","v":{"$error":"#REF!"}}]
[null,null,null,null,null,null,null,null,null,null,null,null,null,null,null,{"$f":"IF(#REF!=\"\",\"\",IF(#REF!<TODAY(),0,IF(#REF!<(TODAY()+365),1,\"X\")))","v":{"$error":"#REF!"}},{"$f":"IF(#REF!=\"\",\"\",\"X\")","v":{"$error":"#REF!"}}]
[null,null,null,null,null,null,null,null,null,null,null,null,null,null,null,{"$f":"IF(#REF!=\"\",\"\",IF(#REF!<TODAY(),0,IF(#REF!<(TODAY()+365),1,\"X\")))","v":{"$error":"#REF!"}},{"$f":"IF(#REF!=\"\",\"\",\"X\")","v":{"$error":"#REF!"}}]
[null,null,null,null,null,null,null,null,null,null,null,null,null,null,null,{"$f":"IF(#REF!=\"\",\"\",IF(#REF!<TODAY(),0,IF(#REF!<(TODAY()+365),1,\"X\")))","v":{"$error":"#REF!"}},{"$f":"IF(#REF!=\"\",\"\",\"X\")","v":{"$error":"#REF!"}}]
[null,null,null,null,null,null,null,null,null,null,null,null,null,null,null,{"$f":"IF(#REF!=\"\",\"\",IF(#REF!<TODAY(),0,IF(#REF!<(TODAY()+365),1,\"X\")))","v":{"$error":"#REF!"}},{"$f":"IF(#REF!=\"\",\"\",\"X\")","v":{"$error":"#REF!"}}]
[null,null,null,null,null,null,null,null,null,null,null,null,null,null,null,{"$f":"IF(#REF!=\"\",\"\",IF(#REF!<TODAY(),0,IF(#REF!<(TODAY()+365),1,\"X\")))","v":{"$error":"#REF!"}},{"$f":"IF(#REF!=\"\",\"\",\"X\")","v":{"$error":"#REF!"}}]
[null,null,null,null,null,null,null,null,null,null,null,null,null,null,null,{"$f":"IF(#REF!=\"\",\"\",IF(#REF!<TODAY(),0,IF(#REF!<(TODAY()+365),1,\"X\")))","v":{"$error":"#REF!"}},{"$f":"IF(#REF!=\"\",\"\",\"X\")","v":{"$error":"#REF!"}}]
[null,null,null,null,null,null,null,null,null,null,null,null,null,null,null,{"$f":"IF(#REF!=\"\",\"\",IF(#REF!<TODAY(),0,IF(#REF!<(TODAY()+365),1,\"X\")))","v":{"$error":"#REF!"}},{"$f":"IF(#REF!=\"\",\"\",\"X\")","v":{"$error":"#REF!"}}]
[null,null,null,null,null,null,null,null,null,null,null,null,null,null,null,{"$f":"IF(#REF!=\"\",\"\",IF(#REF!<TODAY(),0,IF(#REF!<(TODAY()+365),1,\"X\")))","v":{"$error":"#REF!"}},{"$f":"IF(#REF!=\"\",\"\",\"X\")","v":{"$error":"#REF!"}}]
[null,null,null,null,null,null,null,null,null,null,null,null,null,null,null,{"$f":"IF(#REF!=\"\",\"\",IF(#REF!<TODAY(),0,IF(#REF!<(TODAY()+365),1,\"X\")))","v":{"$error":"#REF!"}},{"$f":"IF(#REF!=\"\",\"\",\"X\")","v":{"$error":"#REF!"}}]
[null,null,null,null,null,null,null,null,null,null,null,null,null,null,null,{"$f":"IF(#REF!=\"\",\"\",IF(#REF!<TODAY(),0,IF(#REF!<(TODAY()+365),1,\"X\")))","v":{"$error":"#REF!"}},{"$f":"IF(#REF!=\"\",\"\",\"X\")","v":{"$error":"#REF!"}}]
[null,null,null,null,null,null,null,null,null,null,null,null,null,null,null,{"$f":"IF(#REF!=\"\",\"\",IF(#REF!<TODAY(),0,IF(#REF!<(TODAY()+365),1,\"X\")))","v":{"$error":"#REF!"}},{"$f":"IF(#REF!=\"\",\"\",\"X\")","v":{"$error":"#REF!"}}]
[null,null,null,null,null,null,null,null,null,null,null,null,null,null,null,{"$f":"IF(#REF!=\"\",\"\",IF(#REF!<TODAY(),0,IF(#REF!<(TODAY()+365),1,\"X\")))","v":{"$error":"#REF!"}},{"$f":"IF(#REF!=\"\",\"\",\"X\")","v":{"$error":"#REF!"}}]
[null,null,null,null,null,null,null,null,null,null,null,null,null,null,null,{"$f":"IF(#REF!=\"\",\"\",IF(#REF!<TODAY(),0,IF(#REF!<(TODAY()+365),1,\"X\")))","v":{"$error":"#REF!"}},{"$f":"IF(#REF!=\"\",\"\",\"X\")","v":{"$error":"#REF!"}}]
[null,null,null,null,null,null,null,null,null,null,null,null,null,null,null,{"$f":"IF(#REF!=\"\",\"\",IF(#REF!<TODAY(),0,IF(#REF!<(TODAY()+365),1,\"X\")))","v":{"$error":"#REF!"}},{"$f":"IF(#REF!=\"\",\"\",\"X\")","v":{"$error":"#REF!"}}]
[null,null,null,null,null,null,null,null,null,null,null,null,null,null,null,{"$f":"IF(#REF!=\"\",\"\",IF(#REF!<TODAY(),0,IF(#REF!<(TODAY()+365),1,\"X\")))","v":{"$error":"#REF!"}},{"$f":"IF(#REF!=\"\",\"\",\"X\")","v":{"$error":"#REF!"}}]
[null,null,null,null,null,null,null,null,null,null,null,null,null,null,null,{"$f":"IF(#REF!=\"\",\"\",IF(#REF!<TODAY(),0,IF(#REF!<(TODAY()+365),1,\"X\")))","v":{"$error":"#REF!"}},{"$f":"IF(#REF!=\"\",\"\",\"X\")","v":{"$error":"#REF!"}}]
[null,null,null,null,null,null,null,null,null,null,null,null,null,null,null,{"$f":"IF(#REF!=\"\",\"\",IF(#REF!<TODAY(),0,IF(#REF!<(TODAY()+365),1,\"X\")))","v":{"$error":"#REF!"}},{"$f":"IF(#REF!=\"\",\"\",\"X\")","v":{"$error":"#REF!"}}]
[null,null,null,null,null,null,null,null,null,null,null,null,null,null,null,{"$f":"IF(#REF!=\"\",\"\",IF(#REF!<TODAY(),0,IF(#REF!<(TODAY()+365),1,\"X\")))","v":{"$error":"#REF!"}},{"$f":"IF(#REF!=\"\",\"\",\"X\")","v":{"$error":"#REF!"}}]
[null,null,null,null,null,null,null,null,null,null,null,null,null,null,null,{"$f":"IF(#REF!=\"\",\"\",IF(#REF!<TODAY(),0,IF(#REF!<(TODAY()+365),1,\"X\")))","v":{"$error":"#REF!"}},{"$f":"IF(#REF!=\"\",\"\",\"X\")","v":{"$error":"#REF!"}}]
[null,null,null,null,null,null,null,null,null,null,null,null,null,null,null,{"$f":"IF(#REF!=\"\",\"\",IF(#REF!<TODAY(),0,IF(#REF!<(TODAY()+365),1,\"X\")))","v":{"$error":"#REF!"}},{"$f":"IF(#REF!=\"\",\"\",\"X\")","v":{"$error":"#REF!"}}]
[null,null,null,null,null,null,null,null,null,null,null,null,null,null,null,{"$f":"IF(#REF!=\"\",\"\",IF(#REF!<TODAY(),0,IF(#REF!<(TODAY()+365),1,\"X\")))","v":{"$error":"#REF!"}},{"$f":"IF(#REF!=\"\",\"\",\"X\")","v":{"$error":"#REF!"}}]
[null,null,null,null,null,null,null,null,null,null,null,null,null,null,null,{"$f":"IF(#REF!=\"\",\"\",IF(#REF!<TODAY(),0,IF(#REF!<(TODAY()+365),1,\"X\")))","v":{"$error":"#REF!"}},{"$f":"IF(#REF!=\"\",\"\",\"X\")","v":{"$error":"#REF!"}}]
[null,null,null,null,null,null,null,null,null,null,null,null,null,null,null,{"$f":"IF(#REF!=\"\",\"\",IF(#REF!<TODAY(),0,IF(#REF!<(TODAY()+365),1,\"X\")))","v":{"$error":"#REF!"}},{"$f":"IF(#REF!=\"\",\"\",\"X\")","v":{"$error":"#REF!"}}]
[null,null,null,null,null,null,null,null,null,null,null,null,null,null,null,{"$f":"IF(#REF!=\"\",\"\",IF(#REF!<TODAY(),0,IF(#REF!<(TODAY()+365),1,\"X\")))","v":{"$error":"#REF!"}},{"$f":"IF(#REF!=\"\",\"\",\"X\")","v":{"$error":"#REF!"}}]
[null,null,null,null,null,null,null,null,null,null,null,null,null,null,null,{"$f":"IF(#REF!=\"\",\"\",IF(#REF!<TODAY(),0,IF(#REF!<(TODAY()+365),1,\"X\")))","v":{"$error":"#REF!"}},{"$f":"IF(#REF!=\"\",\"\",\"X\")","v":{"$error":"#REF!"}}]
[null,null,null,null,null,null,null,null,null,null,null,null,null,null,null,{"$f":"IF(#REF!=\"\",\"\",IF(#REF!<TODAY(),0,IF(#REF!<(TODAY()+365),1,\"X\")))","v":{"$error":"#REF!"}},{"$f":"IF(#REF!=\"\",\"\",\"X\")","v":{"$error":"#REF!"}}]
[null,null,null,null,null,null,null,null,null,null,null,null,null,null,null,{"$f":"IF(#REF!=\"\",\"\",IF(#REF!<TODAY(),0,IF(#REF!<(TODAY()+365),1,\"X\")))","v":{"$error":"#REF!"}},{"$f":"IF(#REF!=\"\",\"\",\"X\")","v":{"$error":"#REF!"}}]
[null,null,null,null,null,null,null,null,null,null,null,null,null,null,null,{"$f":"IF(#REF!=\"\",\"\",IF(#REF!<TODAY(),0,IF(#REF!<(TODAY()+365),1,\"X\")))","v":{"$error":"#REF!"}},{"$f":"IF(#REF!=\"\",\"\",\"X\")","v":{"$error":"#REF!"}}]
[null,null,null,null,null,null,null,null,null,null,null,null,null,null,null,{"$f":"IF(#REF!=\"\",\"\",IF(#REF!<TODAY(),0,IF(#REF!<(TODAY()+365),1,\"X\")))","v":{"$error":"#REF!"}},{"$f":"IF(#REF!=\"\",\"\",\"X\")","v":{"$error":"#REF!"}}]
[null,null,null,null,null,null,null,null,null,null,null,null,null,null,null,{"$f":"IF(#REF!=\"\",\"\",IF(#REF!<TODAY(),0,IF(#REF!<(TODAY()+365),1,\"X\")))","v":{"$error":"#REF!"}},{"$f":"IF(#REF!=\"\",\"\",\"X\")","v":{"$error":"#REF!"}}]
[null,null,null,null,null,null,null,null,null,null,null,null,null,null,null,{"$f":"IF(#REF!=\"\",\"\",IF(#REF!<TODAY(),0,IF(#REF!<(TODAY()+365),1,\"X\")))","v":{"$error":"#REF!"}},{"$f":"IF(#REF!=\"\",\"\",\"X\")","v":{"$error":"#REF!"}}]
[null,null,null,null,null,null,null,null,null,null,null,null,null,null,null,{"$f":"IF(#REF!=\"\",\"\",IF(#REF!<TODAY(),0,IF(#REF!<(TODAY()+365),1,\"X\")))","v":{"$error":"#REF!"}},{"$f":"IF(#REF!=\"\",\"\",\"X\")","v":{"$error":"#REF!"}}]
[null,null,null,null,null,null,null,null,null,null,null,null,null,null,null,{"$f":"IF(#REF!=\"\",\"\",IF(#REF!<TODAY(),0,IF(#REF!<(TODAY()+365),1,\"X\")))","v":{"$error":"#REF!"}},{"$f":"IF(#REF!=\"\",\"\",\"X\")","v":{"$error":"#REF!"}}]
[null,null,null,null,null,null,null,null,null,null,null,null,null,null,null,{"$f":"IF(#REF!=\"\",\"\",IF(#REF!<TODAY(),0,IF(#REF!<(TODAY()+365),1,\"X\")))","v":{"$error":"#REF!"}},{"$f":"IF(#REF!=\"\",\"\",\"X\")","v":{"$error":"#REF!"}}]
[null,null,null,null,null,null,null,null,null,null,null,null,null,null,null,{"$f":"IF(#REF!=\"\",\"\",IF(#REF!<TODAY(),0,IF(#REF!<(TODAY()+365),1,\"X\")))","v":{"$error":"#REF!"}},{"$f":"IF(#REF!=\"\",\"\",\"X\")","v":{"$error":"#REF!"}}]
[null,null,null,null,null,null,null,null,null,null,null,null,null,null,null,{"$f":"IF(#REF!=\"\",\"\",IF(#REF!<TODAY(),0,IF(#REF!<(TODAY()+365),1,\"X\")))","v":{"$error":"#REF!"}},{"$f":"IF(#REF!=\"\",\"\",\"X\")","v":{"$error":"#REF!"}}]
[null,null,null,null,null,null,null,null,null,null,null,null,null,null,null,{"$f":"IF(#REF!=\"\",\"\",IF(#REF!<TODAY(),0,IF(#REF!<(TODAY()+365),1,\"X\")))","v":{"$error":"#REF!"}},{"$f":"IF(#REF!=\"\",\"\",\"X\")","v":{"$error":"#REF!"}}]
[null,null,null,null,null,null,null,null,null,null,null,null,null,null,null,{"$f":"IF(#REF!=\"\",\"\",IF(#REF!<TODAY(),0,IF(#REF!<(TODAY()+365),1,\"X\")))","v":{"$error":"#REF!"}},{"$f":"IF(#REF!=\"\",\"\",\"X\")","v":{"$error":"#REF!"}}]
[null,null,null,null,null,null,null,null,null,null,null,null,null,null,null,{"$f":"IF(#REF!=\"\",\"\",IF(#REF!<TODAY(),0,IF(#REF!<(TODAY()+365),1,\"X\")))","v":{"$error":"#REF!"}},{"$f":"IF(#REF!=\"\",\"\",\"X\")","v":{"$error":"#REF!"}}]
[null,null,null,null,null,null,null,null,null,null,null,null,null,null,null,{"$f":"IF(#REF!=\"\",\"\",IF(#REF!<TODAY(),0,IF(#REF!<(TODAY()+365),1,\"X\")))","v":{"$error":"#REF!"}},{"$f":"IF(#REF!=\"\",\"\",\"X\")","v":{"$error":"#REF!"}}]
[null,null,null,null,null,null,null,null,null,null,null,null,null,null,null,{"$f":"IF(#REF!=\"\",\"\",IF(#REF!<TODAY(),0,IF(#REF!<(TODAY()+365),1,\"X\")))","v":{"$error":"#REF!"}},{"$f":"IF(#REF!=\"\",\"\",\"X\")","v":{"$error":"#REF!"}}]
[null,null,null,null,null,null,null,null,null,null,null,null,null,null,null,{"$f":"IF(#REF!=\"\",\"\",IF(#REF!<TODAY(),0,IF(#REF!<(TODAY()+365),1,\"X\")))","v":{"$error":"#REF!"}},{"$f":"IF(#REF!=\"\",\"\",\"X\")","v":{"$error":"#REF!"}}]
[null,null,null,null,null,null,null,null,null,null,null,null,null,null,null,{"$f":"IF(#REF!=\"\",\"\",IF(#REF!<TODAY(),0,IF(#REF!<(TODAY()+365),1,\"X\")))","v":{"$error":"#REF!"}},{"$f":"IF(#REF!=\"\",\"\",\"X\")","v":{"$error":"#REF!"}}]
[null,null,null,null,null,null,null,null,null,null,null,null,null,null,null,{"$f":"IF(#REF!=\"\",\"\",IF(#REF!<TODAY(),0,IF(#REF!<(TODAY()+365),1,\"X\")))","v":{"$error":"#REF!"}},{"$f":"IF(#REF!=\"\",\"\",\"X\")","v":{"$error":"#REF!"}}]
[null,null,null,null,null,null,null,null,null,null,null,null,null,null,null,{"$f":"IF(#REF!=\"\",\"\",IF(#REF!<TODAY(),0,IF(#REF!<(TODAY()+365),1,\"X\")))","v":{"$error":"#REF!"}},{"$f":"IF(#REF!=\"\",\"\",\"X\")","v":{"$error":"#REF!"}}]
[null,null,null,null,null,null,null,null,null,null,null,null,null,null,null,{"$f":"IF(#REF!=\"\",\"\",IF(#REF!<TODAY(),0,IF(#REF!<(TODAY()+365),1,\"X\")))","v":{"$error":"#REF!"}},{"$f":"IF(#REF!=\"\",\"\",\"X\")","v":{"$error":"#REF!"}}]
[null,null,null,null,null,null,null,null,null,null,null,null,null,null,null,{"$f":"IF(#REF!=\"\",\"\",IF(#REF!<TODAY(),0,IF(#REF!<(TODAY()+365),1,\"X\")))","v":{"$error":"#REF!"}},{"$f":"IF(#REF!=\"\",\"\",\"X\")","v":{"$error":"#REF!"}}]
[null,null,null,null,null,null,null,null,null,null,null,null,null,null,null,{"$f":"IF(#REF!=\"\",\"\",IF(#REF!<TODAY(),0,IF(#REF!<(TODAY()+365),1,\"X\")))","v":{"$error":"#REF!"}},{"$f":"IF(#REF!=\"\",\"\",\"X\")","v":{"$error":"#REF!"}}]
[null,null,null,null,null,null,null,null,null,null,null,null,null,null,null,{"$f":"IF(#REF!=\"\",\"\",IF(#REF!<TODAY(),0,IF(#REF!<(TODAY()+365),1,\"X\")))","v":{"$error":"#REF!"}},{"$f":"IF(#REF!=\"\",\"\",\"X\")","v":{"$error":"#REF!"}}]
[null,null,null,null,null,null,null,null,null,null,null,null,null,null,null,{"$f":"IF(#REF!=\"\",\"\",IF(#REF!<TODAY(),0,IF(#REF!<(TODAY()+365),1,\"X\")))","v":{"$error":"#REF!"}},{"$f":"IF(#REF!=\"\",\"\",\"X\")","v":{"$error":"#REF!"}}]
[null,null,null,null,null,null,null,null,null,null,null,null,null,null,null,{"$f":"IF(#REF!=\"\",\"\",IF(#REF!<TODAY(),0,IF(#REF!<(TODAY()+365),1,\"X\")))","v":{"$error":"#REF!"}},{"$f":"IF(#REF!=\"\",\"\",\"X\")","v":{"$error":"#REF!"}}]
[null,null,null,null,null,null,null,null,null,null,null,null,null,null,null,{"$f":"IF(#REF!=\"\",\"\",IF(#REF!<TODAY(),0,IF(#REF!<(TODAY()+365),1,\"X\")))","v":{"$error":"#REF!"}},{"$f":"IF(#REF!=\"\",\"\",\"X\")","v":{"$error":"#REF!"}}]
[null,null,null,null,null,null,null,null,null,null,null,null,null,null,null,{"$f":"IF(#REF!=\"\",\"\",IF(#REF!<TODAY(),0,IF(#REF!<(TODAY()+365),1,\"X\")))","v":{"$error":"#REF!"}},{"$f":"IF(#REF!=\"\",\"\",\"X\")","v":{"$error":"#REF!"}}]
[null,null,null,null,null,null,null,null,null,null,null,null,null,null,null,{"$f":"IF(#REF!=\"\",\"\",IF(#REF!<TODAY(),0,IF(#REF!<(TODAY()+365),1,\"X\")))","v":{"$error":"#REF!"}},{"$f":"IF(#REF!=\"\",\"\",\"X\")","v":{"$error":"#REF!"}}]
[null,null,null,null,null,null,null,null,null,null,null,null,null,null,null,{"$f":"IF(#REF!=\"\",\"\",IF(#REF!<TODAY(),0,IF(#REF!<(TODAY()+365),1,\"X\")))","v":{"$error":"#REF!"}},{"$f":"IF(#REF!=\"\",\"\",\"X\")","v":{"$error":"#REF!"}}]
[null,null,null,null,null,null,null,null,null,null,null,null,null,null,null,{"$f":"IF(#REF!=\"\",\"\",IF(#REF!<TODAY(),0,IF(#REF!<(TODAY()+365),1,\"X\")))","v":{"$error":"#REF!"}},{"$f":"IF(#REF!=\"\",\"\",\"X\")","v":{"$error":"#REF!"}}]
[null,null,null,null,null,null,null,null,null,null,null,null,null,null,null,{"$f":"IF(#REF!=\"\",\"\",IF(#REF!<TODAY(),0,IF(#REF!<(TODAY()+365),1,\"X\")))","v":{"$error":"#REF!"}},{"$f":"IF(#REF!=\"\",\"\",\"X\")","v":{"$error":"#REF!"}}]
[null,null,null,null,null,null,null,null,null,null,null,null,null,null,null,{"$f":"IF(#REF!=\"\",\"\",IF(#REF!<TODAY(),0,IF(#REF!<(TODAY()+365),1,\"X\")))","v":{"$error":"#REF!"}},{"$f":"IF(#REF!=\"\",\"\",\"X\")","v":{"$error":"#REF!"}}]
[null,null,null,null,null,null,null,null,null,null,null,null,null,null,null,{"$f":"IF(#REF!=\"\",\"\",IF(#REF!<TODAY(),0,IF(#REF!<(TODAY()+365),1,\"X\")))","v":{"$error":"#REF!"}},{"$f":"IF(#REF!=\"\",\"\",\"X\")","v":{"$error":"#REF!"}}]
[null,null,null,null,null,null,null,null,null,null,null,null,null,null,null,{"$f":"IF(#REF!=\"\",\"\",IF(#REF!<TODAY(),0,IF(#REF!<(TODAY()+365),1,\"X\")))","v":{"$error":"#REF!"}},{"$f":"IF(#REF!=\"\",\"\",\"X\")","v":{"$error":"#REF!"}}]
[null,null,null,null,null,null,null,null,null,null,null,null,null,null,null,{"$f":"IF(#REF!=\"\",\"\",IF(#REF!<TODAY(),0,IF(#REF!<(TODAY()+365),1,\"X\")))","v":{"$error":"#REF!"}},{"$f":"IF(#REF!=\"\",\"\",\"X\")","v":{"$error":"#REF!"}}]
[null,null,null,null,null,null,null,null,null,null,null,null,null,null,null,{"$f":"IF(#REF!=\"\",\"\",IF(#REF!<TODAY(),0,IF(#REF!<(TODAY()+365),1,\"X\")))","v":{"$error":"#REF!"}},{"$f":"IF(#REF!=\"\",\"\",\"X\")","v":{"$error":"#REF!"}}]
[null,null,null,null,null,null,null,null,null,null,null,null,null,null,null,{"$f":"IF(#REF!=\"\",\"\",IF(#REF!<TODAY(),0,IF(#REF!<(TODAY()+365),1,\"X\")))","v":{"$error":"#REF!"}},{"$f":"IF(#REF!=\"\",\"\",\"X\")","v":{"$error":"#REF!"}}]
[null,null,null,null,null,null,null,null,null,null,null,null,null,null,null,{"$f":"IF(#REF!=\"\",\"\",IF(#REF!<TODAY(),0,IF(#REF!<(TODAY()+365),1,\"X\")))","v":{"$error":"#REF!"}},{"$f":"IF(#REF!=\"\",\"\",\"X\")","v":{"$error":"#REF!"}}]
[null,null,null,null,null,null,null,null,null,null,null,null,null,null,null,{"$f":"IF(#REF!=\"\",\"\",IF(#REF!<TODAY(),0,IF(#REF!<(TODAY()+365),1,\"X\")))","v":{"$error":"#REF!"}},{"$f":"IF(#REF!=\"\",\"\",\"X\")","v":{"$error":"#REF!"}}]
[null,null,null,null,null,null,null,null,null,null,null,null,null,null,null,{"$f":"IF(#REF!=\"\",\"\",IF(#REF!<TODAY(),0,IF(#REF!<(TODAY()+365),1,\"X\")))","v":{"$error":"#REF!"}},{"$f":"IF(#REF!=\"\",\"\",\"X\")","v":{"$error":"#REF!"}}]
[null,null,null,null,null,null,null,null,null,null,null,null,null,null,null,{"$f":"IF(#REF!=\"\",\"\",IF(#REF!<TODAY(),0,IF(#REF!<(TODAY()+365),1,\"X\")))","v":{"$error":"#REF!"}},{"$f":"IF(#REF!=\"\",\"\",\"X\")","v":{"$error":"#REF!"}}]
[null,null,null,null,null,null,null,null,null,null,null,null,null,null,null,{"$f":"IF(#REF!=\"\",\"\",IF(#REF!<TODAY(),0,IF(#REF!<(TODAY()+365),1,\"X\")))","v":{"$error":"#REF!"}},{"$f":"IF(#REF!=\"\",\"\",\"X\")","v":{"$error":"#REF!"}}]
[null,null,null,null,null,null,null,null,null,null,null,null,null,null,null,{"$f":"IF(#REF!=\"\",\"\",IF(#REF!<TODAY(),0,IF(#REF!<(TODAY()+365),1,\"X\")))","v":{"$error":"#REF!"}},{"$f":"IF(#REF!=\"\",\"\",\"X\")","v":{"$error":"#REF!"}}]
[null,null,null,null,null,null,null,null,null,null,null,null,null,null,null,{"$f":"IF(#REF!=\"\",\"\",IF(#REF!<TODAY(),0,IF(#REF!<(TODAY()+365),1,\"X\")))","v":{"$error":"#REF!"}},{"$f":"IF(#REF!=\"\",\"\",\"X\")","v":{"$error":"#REF!"}}]
[null,null,null,null,null,null,null,null,null,null,null,null,null,null,null,{"$f":"IF(#REF!=\"\",\"\",IF(#REF!<TODAY(),0,IF(#REF!<(TODAY()+365),1,\"X\")))","v":{"$error":"#REF!"}},{"$f":"IF(#REF!=\"\",\"\",\"X\")","v":{"$error":"#REF!"}}]
[null,null,null,null,null,null,null,null,null,null,null,null,null,null,null,{"$f":"IF(#REF!=\"\",\"\",IF(#REF!<TODAY(),0,IF(#REF!<(TODAY()+365),1,\"X\")))","v":{"$error":"#REF!"}},{"$f":"IF(#REF!=\"\",\"\",\"X\")","v":{"$error":"#REF!"}}]
[null,null,null,null,null,null,null,null,null,null,null,null,null,null,null,{"$f":"IF(#REF!=\"\",\"\",IF(#REF!<TODAY(),0,IF(#REF!<(TODAY()+365),1,\"X\")))","v":{"$error":"#REF!"}},{"$f":"IF(#REF!=\"\",\"\",\"X\")","v":{"$error":"#REF!"}}]
[null,null,null,null,null,null,null,null,null,null,null,null,null,null,null,{"$f":"IF(#REF!=\"\",\"\",IF(#REF!<TODAY(),0,IF(#REF!<(TODAY()+365),1,\"X\")))","v":{"$error":"#REF!"}},{"$f":"IF(#REF!=\"\",\"\",\"X\")","v":{"$error":"#REF!"}}]
[null,null,null,null,null,null,null,null,null,null,null,null,null,null,null,{"$f":"IF(#REF!=\"\",\"\",IF(#REF!<TODAY(),0,IF(#REF!<(TODAY()+365),1,\"X\")))","v":{"$error":"#REF!"}},{"$f":"IF(#REF!=\"\",\"\",\"X\")","v":{"$error":"#REF!"}}]
[null,null,null,null,null,null,null,null,null,null,null,null,null,null,null,{"$f":"IF(#REF!=\"\",\"\",IF(#REF!<TODAY(),0,IF(#REF!<(TODAY()+365),1,\"X\")))","v":{"$error":"#REF!"}},{"$f":"IF(#REF!=\"\",\"\",\"X\")","v":{"$error":"#REF!"}}]
[null,null,null,null,null,null,null,null,null,null,null,null,null,null,null,{"$f":"IF(#REF!=\"\",\"\",IF(#REF!<TODAY(),0,IF(#REF!<(TODAY()+365),1,\"X\")))","v":{"$error":"#REF!"}},{"$f":"IF(#REF!=\"\",\"\",\"X\")","v":{"$error":"#REF!"}}]
[null,null,null,null,null,null,null,null,null,null,null,null,null,null,null,{"$f":"IF(#REF!=\"\",\"\",IF(#REF!<TODAY(),0,IF(#REF!<(TODAY()+365),1,\"X\")))","v":{"$error":"#REF!"}},{"$f":"IF(#REF!=\"\",\"\",\"X\")","v":{"$error":"#REF!"}}]
[null,null,null,null,null,null,null,null,null,null,null,null,null,null,null,{"$f":"IF(#REF!=\"\",\"\",IF(#REF!<TODAY(),0,IF(#REF!<(TODAY()+365),1,\"X\")))","v":{"$error":"#REF!"}},{"$f":"IF(#REF!=\"\",\"\",\"X\")","v":{"$error":"#REF!"}}]
[null,null,null,null,null,null,null,null,null,null,null,null,null,null,null,{"$f":"IF(#REF!=\"\",\"\",IF(#REF!<TODAY(),0,IF(#REF!<(TODAY()+365),1,\"X\")))","v":{"$error":"#REF!"}},{"$f":"IF(#REF!=\"\",\"\",\"X\")","v":{"$error":"#REF!"}}]
[null,null,null,null,null,null,null,null,null,null,null,null,null,null,null,{"$f":"IF(#REF!=\"\",\"\",IF(#REF!<TODAY(),0,IF(#REF!<(TODAY()+365),1,\"X\")))","v":{"$error":"#REF!"}},{"$f":"IF(#REF!=\"\",\"\",\"X\")","v":{"$error":"#REF!"}}]
[null,null,null,null,null,null,null,null,null,null,null,null,null,null,null,{"$f":"IF(#REF!=\"\",\"\",IF(#REF!<TODAY(),0,IF(#REF!<(TODAY()+365),1,\"X\")))","v":{"$error":"#REF!"}},{"$f":"IF(#REF!=\"\",\"\",\"X\")","v":{"$error":"#REF!"}}]
[null,null,null,null,null,null,null,null,null,null,null,null,null,null,null,{"$f":"IF(#REF!=\"\",\"\",IF(#REF!<TODAY(),0,IF(#REF!<(TODAY()+365),1,\"X\")))","v":{"$error":"#REF!"}},{"$f":"IF(#REF!=\"\",\"\",\"X\")","v":{"$error":"#REF!"}}]
[null,null,null,null,null,null,null,null,null,null,null,null,null,null,null,{"$f":"IF(#REF!=\"\",\"\",IF(#REF!<TODAY(),0,IF(#REF!<(TODAY()+365),1,\"X\")))","v":{"$error":"#REF!"}},{"$f":"IF(#REF!=\"\",\"\",\"X\")","v":{"$error":"#REF!"}}]
[null,null,null,null,null,null,null,null,null,null,null,null,null,null,null,{"$f":"IF(#REF!=\"\",\"\",IF(#REF!<TODAY(),0,IF(#REF!<(TODAY()+365),1,\"X\")))","v":{"$error":"#REF!"}},{"$f":"IF(#REF!=\"\",\"\",\"X\")","v":{"$error":"#REF!"}}]
[null,null,null,null,null,null,null,null,null,null,null,null,null,null,null,{"$f":"IF(#REF!=\"\",\"\",IF(#REF!<TODAY(),0,IF(#REF!<(TODAY()+365),1,\"X\")))","v":{"$error":"#REF!"}},{"$f":"IF(#REF!=\"\",\"\",\"X\")","v":{"$error":"#REF!"}}]
[null,null,null,null,null,null,null,null,null,null,null,null,null,null,null,{"$f":"IF(#REF!=\"\",\"\",IF(#REF!<TODAY(),0,IF(#REF!<(TODAY()+365),1,\"X\")))","v":{"$error":"#REF!"}},{"$f":"IF(#REF!=\"\",\"\",\"X\")","v":{"$error":"#REF!"}}]
[null,null,null,null,null,null,null,null,null,null,null,null,null,null,null,{"$f":"IF(#REF!=\"\",\"\",IF(#REF!<TODAY(),0,IF(#REF!<(TODAY()+365),1,\"X\")))","v":{"$error":"#REF!"}},{"$f":"IF(#REF!=\"\",\"\",\"X\")","v":{"$error":"#REF!"}}]
[null,null,null,null,null,null,null,null,null,null,null,null,null,null,null,{"$f":"IF(#REF!=\"\",\"\",IF(#REF!<TODAY(),0,IF(#REF!<(TODAY()+365),1,\"X\")))","v":{"$error":"#REF!"}},{"$f":"IF(#REF!=\"\",\"\",\"X\")","v":{"$error":"#REF!"}}]
[null,null,null,null,null,null,null,null,null,null,null,null,null,null,null,{"$f":"IF(#REF!=\"\",\"\",IF(#REF!<TODAY(),0,IF(#REF!<(TODAY()+365),1,\"X\")))","v":{"$error":"#REF!"}},{"$f":"IF(#REF!=\"\",\"\",\"X\")","v":{"$error":"#REF!"}}]
[null,null,null,null,null,null,null,null,null,null,null,null,null,null,null,{"$f":"IF(#REF!=\"\",\"\",IF(#REF!<TODAY(),0,IF(#REF!<(TODAY()+365),1,\"X\")))","v":{"$error":"#REF!"}},{"$f":"IF(#REF!=\"\",\"\",\"X\")","v":{"$error":"#REF!"}}]
[null,null,null,null,null,null,null,null,null,null,null,null,null,null,null,{"$f":"IF(#REF!=\"\",\"\",IF(#REF!<TODAY(),0,IF(#REF!<(TODAY()+365),1,\"X\")))","v":{"$error":"#REF!"}},{"$f":"IF(#REF!=\"\",\"\",\"X\")","v":{"$error":"#REF!"}}]
[null,null,null,null,null,null,null,null,null,null,null,null,null,null,null,{"$f":"IF(#REF!=\"\",\"\",IF(#REF!<TODAY(),0,IF(#REF!<(TODAY()+365),1,\"X\")))","v":{"$error":"#REF!"}},{"$f":"IF(#REF!=\"\",\"\",\"X\")","v":{"$error":"#REF!"}}]
[null,null,null,null,null,null,null,null,null,null,null,null,null,null,null,{"$f":"IF(#REF!=\"\",\"\",IF(#REF!<TODAY(),0,IF(#REF!<(TODAY()+365),1,\"X\")))","v":{"$error":"#REF!"}},{"$f":"IF(#REF!=\"\",\"\",\"X\")","v":{"$error":"#REF!"}}]
[null,null,null,null,null,null,null,null,null,null,null,null,null,null,null,{"$f":"IF(#REF!=\"\",\"\",IF(#REF!<TODAY(),0,IF(#REF!<(TODAY()+365),1,\"X\")))","v":{"$error":"#REF!"}},{"$f":"IF(#REF!=\"\",\"\",\"X\")","v":{"$error":"#REF!"}}]
[null,null,null,null,null,null,null,null,null,null,null,null,null,null,null,{"$f":"IF(#REF!=\"\",\"\",IF(#REF!<TODAY(),0,IF(#REF!<(TODAY()+365),1,\"X\")))","v":{"$error":"#REF!"}},{"$f":"IF(#REF!=\"\",\"\",\"X\")","v":{"$error":"#REF!"}}]
[null,null,null,null,null,null,null,null,null,null,null,null,null,null,null,{"$f":"IF(#REF!=\"\",\"\",IF(#REF!<TODAY(),0,IF(#REF!<(TODAY()+365),1,\"X\")))","v":{"$error":"#REF!"}},{"$f":"IF(#REF!=\"\",\"\",\"X\")","v":{"$error":"#REF!"}}]
[null,null,null,null,null,null,null,null,null,null,null,null,null,null,null,{"$f":"IF(#REF!=\"\",\"\",IF(#REF!<TODAY(),0,IF(#REF!<(TODAY()+365),1,\"X\")))","v":{"$error":"#REF!"}},{"$f":"IF(#REF!=\"\",\"\",\"X\")","v":{"$error":"#REF!"}}]
[null,null,null,null,null,null,null,null,null,null,null,null,null,null,null,{"$f":"IF(#REF!=\"\",\"\",IF(#REF!<TODAY(),0,IF(#REF!<(TODAY()+365),1,\"X\")))","v":{"$error":"#REF!"}},{"$f":"IF(#REF!=\"\",\"\",\"X\")","v":{"$error":"#REF!"}}]
[null,null,null,null,null,null,null,null,null,null,null,null,null,null,null,{"$f":"IF(#REF!=\"\",\"\",IF(#REF!<TODAY(),0,IF(#REF!<(TODAY()+365),1,\"X\")))","v":{"$error":"#REF!"}},{"$f":"IF(#REF!=\"\",\"\",\"X\")","v":{"$error":"#REF!"}}]
[null,null,null,null,null,null,null,null,null,null,null,null,null,null,null,{"$f":"IF(#REF!=\"\",\"\",IF(#REF!<TODAY(),0,IF(#REF!<(TODAY()+365),1,\"X\")))","v":{"$error":"#REF!"}},{"$f":"IF(#REF!=\"\",\"\",\"X\")","v":{"$error":"#REF!"}}]
[null,null,null,null,null,null,null,null,null,null,null,null,null,null,null,{"$f":"IF(#REF!=\"\",\"\",IF(#REF!<TODAY(),0,IF(#REF!<(TODAY()+365),1,\"X\")))","v":{"$error":"#REF!"}},{"$f":"IF(#REF!=\"\",\"\",\"X\")","v":{"$error":"#REF!"}}]
[null,null,null,null,null,null,null,null,null,null,null,null,null,null,null,{"$f":"IF(#REF!=\"\",\"\",IF(#REF!<TODAY(),0,IF(#REF!<(TODAY()+365),1,\"X\")))","v":{"$error":"#REF!"}},{"$f":"IF(#REF!=\"\",\"\",\"X\")","v":{"$error":"#REF!"}}]
[null,null,null,null,null,null,null,null,null,null,null,null,null,null,null,{"$f":"IF(#REF!=\"\",\"\",IF(#REF!<TODAY(),0,IF(#REF!<(TODAY()+365),1,\"X\")))","v":{"$error":"#REF!"}},{"$f":"IF(#REF!=\"\",\"\",\"X\")","v":{"$error":"#REF!"}}]
[null,null,null,null,null,null,null,null,null,null,null,null,null,null,null,{"$f":"IF(#REF!=\"\",\"\",IF(#REF!<TODAY(),0,IF(#REF!<(TODAY()+365),1,\"X\")))","v":{"$error":"#REF!"}},{"$f":"IF(#REF!=\"\",\"\",\"X\")","v":{"$error":"#REF!"}}]
[null,null,null,null,null,null,null,null,null,null,null,null,null,null,null,{"$f":"IF(#REF!=\"\",\"\",IF(#REF!<TODAY(),0,IF(#REF!<(TODAY()+365),1,\"X\")))","v":{"$error":"#REF!"}},{"$f":"IF(#REF!=\"\",\"\",\"X\")","v":{"$error":"#REF!"}}]
[null,null,null,null,null,null,null,null,null,null,null,null,null,null,null,{"$f":"IF(#REF!=\"\",\"\",IF(#REF!<TODAY(),0,IF(#REF!<(TODAY()+365),1,\"X\")))","v":{"$error":"#REF!"}},{"$f":"IF(#REF!=\"\",\"\",\"X\")","v":{"$error":"#REF!"}}]
[null,null,null,null,null,null,null,null,null,null,null,null,null,null,null,{"$f":"IF(#REF!=\"\",\"\",IF(#REF!<TODAY(),0,IF(#REF!<(TODAY()+365),1,\"X\")))","v":{"$error":"#REF!"}},{"$f":"IF(#REF!=\"\",\"\",\"X\")","v":{"$error":"#REF!"}}]
[null,null,null,null,null,null,null,null,null,null,null,null,null,null,null,{"$f":"IF(#REF!=\"\",\"\",IF(#REF!<TODAY(),0,IF(#REF!<(TODAY()+365),1,\"X\")))","v":{"$error":"#REF!"}},{"$f":"IF(#REF!=\"\",\"\",\"X\")","v":{"$error":"#REF!"}}]
[null,null,null,null,null,null,null,null,null,null,null,null,null,null,null,{"$f":"IF(#REF!=\"\",\"\",IF(#REF!<TODAY(),0,IF(#REF!<(TODAY()+365),1,\"X\")))","v":{"$error":"#REF!"}},{"$f":"IF(#REF!=\"\",\"\",\"X\")","v":{"$error":"#REF!"}}]
[null,null,null,null,null,null,null,null,null,null,null,null,null,null,null,{"$f":"IF(#REF!=\"\",\"\",IF(#REF!<TODAY(),0,IF(#REF!<(TODAY()+365),1,\"X\")))","v":{"$error":"#REF!"}},{"$f":"IF(#REF!=\"\",\"\",\"X\")","v":{"$error":"#REF!"}}]
[null,null,null,null,null,null,null,null,null,null,null,null,null,null,null,{"$f":"IF(#REF!=\"\",\"\",IF(#REF!<TODAY(),0,IF(#REF!<(TODAY()+365),1,\"X\")))","v":{"$error":"#REF!"}},{"$f":"IF(#REF!=\"\",\"\",\"X\")","v":{"$error":"#REF!"}}]
[null,null,null,null,null,null,null,null,null,null,null,null,null,null,null,{"$f":"IF(#REF!=\"\",\"\",IF(#REF!<TODAY(),0,IF(#REF!<(TODAY()+365),1,\"X\")))","v":{"$error":"#REF!"}},{"$f":"IF(#REF!=\"\",\"\",\"X\")","v":{"$error":"#REF!"}}]
[null,null,null,null,null,null,null,null,null,null,null,null,null,null,null,{"$f":"IF(#REF!=\"\",\"\",IF(#REF!<TODAY(),0,IF(#REF!<(TODAY()+365),1,\"X\")))","v":{"$error":"#REF!"}},{"$f":"IF(#REF!=\"\",\"\",\"X\")","v":{"$error":"#REF!"}}]
[null,null,null,null,null,null,null,null,null,null,null,null,null,null,null,{"$f":"IF(#REF!=\"\",\"\",IF(#REF!<TODAY(),0,IF(#REF!<(TODAY()+365),1,\"X\")))","v":{"$error":"#REF!"}},{"$f":"IF(#REF!=\"\",\"\",\"X\")","v":{"$error":"#REF!"}}]
[null,null,null,null,null,null,null,null,null,null,null,null,null,null,null,{"$f":"IF(#REF!=\"\",\"\",IF(#REF!<TODAY(),0,IF(#REF!<(TODAY()+365),1,\"X\")))","v":{"$error":"#REF!"}},{"$f":"IF(#REF!=\"\",\"\",\"X\")","v":{"$error":"#REF!"}}]
[null,null,null,null,null,null,null,null,null,null,null,null,null,null,null,{"$f":"IF(#REF!=\"\",\"\",IF(#REF!<TODAY(),0,IF(#REF!<(TODAY()+365),1,\"X\")))","v":{"$error":"#REF!"}},{"$f":"IF(#REF!=\"\",\"\",\"X\")","v":{"$error":"#REF!"}}]
[null,null,null,null,null,null,null,null,null,null,null,null,null,null,null,{"$f":"IF(#REF!=\"\",\"\",IF(#REF!<TODAY(),0,IF(#REF!<(TODAY()+365),1,\"X\")))","v":{"$error":"#REF!"}},{"$f":"IF(#REF!=\"\",\"\",\"X\")","v":{"$error":"#REF!"}}]
[null,null,null,null,null,null,null,null,null,null,null,null,null,null,null,{"$f":"IF(#REF!=\"\",\"\",IF(#REF!<TODAY(),0,IF(#REF!<(TODAY()+365),1,\"X\")))","v":{"$error":"#REF!"}},{"$f":"IF(#REF!=\"\",\"\",\"X\")","v":{"$error":"#REF!"}}]
[null,null,null,null,null,null,null,null,null,null,null,null,null,null,null,{"$f":"IF(#REF!=\"\",\"\",IF(#REF!<TODAY(),0,IF(#REF!<(TODAY()+365),1,\"X\")))","v":{"$error":"#REF!"}},{"$f":"IF(#REF!=\"\",\"\",\"X\")","v":{"$error":"#REF!"}}]
[null,null,null,null,null,null,null,null,null,null,null,null,null,null,null,{"$f":"IF(#REF!=\"\",\"\",IF(#REF!<TODAY(),0,IF(#REF!<(TODAY()+365),1,\"X\")))","v":{"$error":"#REF!"}},{"$f":"IF(#REF!=\"\",\"\",\"X\")","v":{"$error":"#REF!"}}]
[null,null,null,null,null,null,null,null,null,null,null,null,null,null,null,{"$f":"IF(#REF!=\"\",\"\",IF(#REF!<TODAY(),0,IF(#REF!<(TODAY()+365),1,\"X\")))","v":{"$error":"#REF!"}},{"$f":"IF(#REF!=\"\",\"\",\"X\")","v":{"$error":"#REF!"}}]
[null,null,null,null,null,null,null,null,null,null,null,null,null,null,null,{"$f":"IF(#REF!=\"\",\"\",IF(#REF!<TODAY(),0,IF(#REF!<(TODAY()+365),1,\"X\")))","v":{"$error":"#REF!"}},{"$f":"IF(#REF!=\"\",\"\",\"X\")","v":{"$error":"#REF!"}}]
[null,null,null,null,null,null,null,null,null,null,null,null,null,null,null,{"$f":"IF(#REF!=\"\",\"\",IF(#REF!<TODAY(),0,IF(#REF!<(TODAY()+365),1,\"X\")))","v":{"$error":"#REF!"}},{"$f":"IF(#REF!=\"\",\"\",\"X\")","v":{"$error":"#REF!"}}]
[null,null,null,null,null,null,null,null,null,null,null,null,null,null,null,{"$f":"IF(#REF!=\"\",\"\",IF(#REF!<TODAY(),0,IF(#REF!<(TODAY()+365),1,\"X\")))","v":{"$error":"#REF!"}},{"$f":"IF(#REF!=\"\",\"\",\"X\")","v":{"$error":"#REF!"}}]
[null,null,null,null,null,null,null,null,null,null,null,null,null,null,null,{"$f":"IF(#REF!=\"\",\"\",IF(#REF!<TODAY(),0,IF(#REF!<(TODAY()+365),1,\"X\")))","v":{"$error":"#REF!"}},{"$f":"IF(#REF!=\"\",\"\",\"X\")","v":{"$error":"#REF!"}}]
[null,null,null,null,null,null,null,null,null,null,null,null,null,null,null,{"$f":"IF(#REF!=\"\",\"\",IF(#REF!<TODAY(),0,IF(#REF!<(TODAY()+365),1,\"X\")))","v":{"$error":"#REF!"}},{"$f":"IF(#REF!=\"\",\"\",\"X\")","v":{"$error":"#REF!"}}]
[null,null,null,null,null,null,null,null,null,null,null,null,null,null,null,{"$f":"IF(#REF!=\"\",\"\",IF(#REF!<TODAY(),0,IF(#REF!<(TODAY()+365),1,\"X\")))","v":{"$error":"#REF!"}},{"$f":"IF(#REF!=\"\",\"\",\"X\")","v":{"$error":"#REF!"}}]
[null,null,null,null,null,null,null,null,null,null,null,null,null,null,null,{"$f":"IF(#REF!=\"\",\"\",IF(#REF!<TODAY(),0,IF(#REF!<(TODAY()+365),1,\"X\")))","v":{"$error":"#REF!"}},{"$f":"IF(#REF!=\"\",\"\",\"X\")","v":{"$error":"#REF!"}}]
[null,null,null,null,null,null,null,null,null,null,null,null,null,null,null,{"$f":"IF(#REF!=\"\",\"\",IF(#REF!<TODAY(),0,IF(#REF!<(TODAY()+365),1,\"X\")))","v":{"$error":"#REF!"}},{"$f":"IF(#REF!=\"\",\"\",\"X\")","v":{"$error":"#REF!"}}]
[null,null,null,null,null,null,null,null,null,null,null,null,null,null,null,{"$f":"IF(#REF!=\"\",\"\",IF(#REF!<TODAY(),0,IF(#REF!<(TODAY()+365),1,\"X\")))","v":{"$error":"#REF!"}},{"$f":"IF(#REF!=\"\",\"\",\"X\")","v":{"$error":"#REF!"}}]
[null,null,null,null,null,null,null,null,null,null,null,null,null,null,null,{"$f":"IF(#REF!=\"\",\"\",IF(#REF!<TODAY(),0,IF(#REF!<(TODAY()+365),1,\"X\")))","v":{"$error":"#REF!"}},{"$f":"IF(#REF!=\"\",\"\",\"X\")","v":{"$error":"#REF!"}}]
[null,null,null,null,null,null,null,null,null,null,null,null,null,null,null,{"$f":"IF(#REF!=\"\",\"\",IF(#REF!<TODAY(),0,IF(#REF!<(TODAY()+365),1,\"X\")))","v":{"$error":"#REF!"}},{"$f":"IF(#REF!=\"\",\"\",\"X\")","v":{"$error":"#REF!"}}]
[null,null,null,null,null,null,null,null,null,null,null,null,null,null,null,{"$f":"IF(#REF!=\"\",\"\",IF(#REF!<TODAY(),0,IF(#REF!<(TODAY()+365),1,\"X\")))","v":{"$error":"#REF!"}},{"$f":"IF(#REF!=\"\",\"\",\"X\")","v":{"$error":"#REF!"}}]
[null,null,null,null,null,null,null,null,null,null,null,null,null,null,null,{"$f":"IF(#REF!=\"\",\"\",IF(#REF!<TODAY(),0,IF(#REF!<(TODAY()+365),1,\"X\")))","v":{"$error":"#REF!"}},{"$f":"IF(#REF!=\"\",\"\",\"X\")","v":{"$error":"#REF!"}}]
[null,null,null,null,null,null,null,null,null,null,null,null,null,null,null,{"$f":"IF(#REF!=\"\",\"\",IF(#REF!<TODAY(),0,IF(#REF!<(TODAY()+365),1,\"X\")))","v":{"$error":"#REF!"}},{"$f":"IF(#REF!=\"\",\"\",\"X\")","v":{"$error":"#REF!"}}]
[null,null,null,null,null,null,null,null,null,null,null,null,null,null,null,{"$f":"IF(#REF!=\"\",\"\",IF(#REF!<TODAY(),0,IF(#REF!<(TODAY()+365),1,\"X\")))","v":{"$error":"#REF!"}},{"$f":"IF(#REF!=\"\",\"\",\"X\")","v":{"$error":"#REF!"}}]
[null,null,null,null,null,null,null,null,null,null,null,null,null,null,null,{"$f":"IF(#REF!=\"\",\"\",IF(#REF!<TODAY(),0,IF(#REF!<(TODAY()+365),1,\"X\")))","v":{"$error":"#REF!"}},{"$f":"IF(#REF!=\"\",\"\",\"X\")","v":{"$error":"#REF!"}}]
[null,null,null,null,null,null,null,null,null,null,null,null,null,null,null,{"$f":"IF(#REF!=\"\",\"\",IF(#REF!<TODAY(),0,IF(#REF!<(TODAY()+365),1,\"X\")))","v":{"$error":"#REF!"}},{"$f":"IF(#REF!=\"\",\"\",\"X\")","v":{"$error":"#REF!"}}]
[null,null,null,null,null,null,null,null,null,null,null,null,null,null,null,{"$f":"IF(#REF!=\"\",\"\",IF(#REF!<TODAY(),0,IF(#REF!<(TODAY()+365),1,\"X\")))","v":{"$error":"#REF!"}},{"$f":"IF(#REF!=\"\",\"\",\"X\")","v":{"$error":"#REF!"}}]
[null,null,null,null,null,null,null,null,null,null,null,null,null,null,null,{"$f":"IF(#REF!=\"\",\"\",IF(#REF!<TODAY(),0,IF(#REF!<(TODAY()+365),1,\"X\")))","v":{"$error":"#REF!"}},{"$f":"IF(#REF!=\"\",\"\",\"X\")","v":{"$error":"#REF!"}}]
[null,null,null,null,null,null,null,null,null,null,null,null,null,null,null,{"$f":"IF(#REF!=\"\",\"\",IF(#REF!<TODAY(),0,IF(#REF!<(TODAY()+365),1,\"X\")))","v":{"$error":"#REF!"}},{"$f":"IF(#REF!=\"\",\"\",\"X\")","v":{"$error":"#REF!"}}]
[null,null,null,null,null,null,null,null,null,null,null,null,null,null,null,{"$f":"IF(#REF!=\"\",\"\",IF(#REF!<TODAY(),0,IF(#REF!<(TODAY()+365),1,\"X\")))","v":{"$error":"#REF!"}},{"$f":"IF(#REF!=\"\",\"\",\"X\")","v":{"$error":"#REF!"}}]
[null,null,null,null,null,null,null,null,null,null,null,null,null,null,null,{"$f":"IF(#REF!=\"\",\"\",IF(#REF!<TODAY(),0,IF(#REF!<(TODAY()+365),1,\"X\")))","v":{"$error":"#REF!"}},{"$f":"IF(#REF!=\"\",\"\",\"X\")","v":{"$error":"#REF!"}}]
[null,null,null,null,null,null,null,null,null,null,null,null,null,null,null,{"$f":"IF(#REF!=\"\",\"\",IF(#REF!<TODAY(),0,IF(#REF!<(TODAY()+365),1,\"X\")))","v":{"$error":"#REF!"}},{"$f":"IF(#REF!=\"\",\"\",\"X\")","v":{"$error":"#REF!"}}]
[null,null,null,null,null,null,null,null,null,null,null,null,null,null,null,{"$f":"IF(#REF!=\"\",\"\",IF(#REF!<TODAY(),0,IF(#REF!<(TODAY()+365),1,\"X\")))","v":{"$error":"#REF!"}},{"$f":"IF(#REF!=\"\",\"\",\"X\")","v":{"$error":"#REF!"}}]
[null,null,null,null,null,null,null,null,null,null,null,null,null,null,null,{"$f":"IF(#REF!=\"\",\"\",IF(#REF!<TODAY(),0,IF(#REF!<(TODAY()+365),1,\"X\")))","v":{"$error":"#REF!"}},{"$f":"IF(#REF!=\"\",\"\",\"X\")","v":{"$error":"#REF!"}}]
[null,null,null,null,null,null,null,null,null,null,null,null,null,null,null,{"$f":"IF(#REF!=\"\",\"\",IF(#REF!<TODAY(),0,IF(#REF!<(TODAY()+365),1,\"X\")))","v":{"$error":"#REF!"}},{"$f":"IF(#REF!=\"\",\"\",\"X\")","v":{"$error":"#REF!"}}]
[null,null,null,null,null,null,null,null,null,null,null,null,null,null,null,{"$f":"IF(#REF!=\"\",\"\",IF(#REF!<TODAY(),0,IF(#REF!<(TODAY()+365),1,\"X\")))","v":{"$error":"#REF!"}},{"$f":"IF(#REF!=\"\",\"\",\"X\")","v":{"$error":"#REF!"}}]
[null,null,null,null,null,null,null,null,null,null,null,null,null,null,null,{"$f":"IF(#REF!=\"\",\"\",IF(#REF!<TODAY(),0,IF(#REF!<(TODAY()+365),1,\"X\")))","v":{"$error":"#REF!"}},{"$f":"IF(#REF!=\"\",\"\",\"X\")","v":{"$error":"#REF!"}}]
[null,null,null,null,null,null,null,null,null,null,null,null,null,null,null,{"$f":"IF(#REF!=\"\",\"\",IF(#REF!<TODAY(),0,IF(#REF!<(TODAY()+365),1,\"X\")))","v":{"$error":"#REF!"}},{"$f":"IF(#REF!=\"\",\"\",\"X\")","v":{"$error":"#REF!"}}]
[null,null,null,null,null,null,null,null,null,null,null,null,null,null,null,{"$f":"IF(#REF!=\"\",\"\",IF(#REF!<TODAY(),0,IF(#REF!<(TODAY()+365),1,\"X\")))","v":{"$error":"#REF!"}},{"$f":"IF(#REF!=\"\",\"\",\"X\")","v":{"$error":"#REF!"}}]
[null,null,null,null,null,null,null,null,null,null,null,null,null,null,null,{"$f":"IF(#REF!=\"\",\"\",IF(#REF!<TODAY(),0,IF(#REF!<(TODAY()+365),1,\"X\")))","v":{"$error":"#REF!"}},{"$f":"IF(#REF!=\"\",\"\",\"X\")","v":{"$error":"#REF!"}}]
[null,null,null,null,null,null,null,null,null,null,null,null,null,null,null,{"$f":"IF(#REF!=\"\",\"\",IF(#REF!<TODAY(),0,IF(#REF!<(TODAY()+365),1,\"X\")))","v":{"$error":"#REF!"}},{"$f":"IF(#REF!=\"\",\"\",\"X\")","v":{"$error":"#REF!"}}]
[null,null,null,null,null,null,null,null,null,null,null,null,null,null,null,{"$f":"IF(#REF!=\"\",\"\",IF(#REF!<TODAY(),0,IF(#REF!<(TODAY()+365),1,\"X\")))","v":{"$error":"#REF!"}},{"$f":"IF(#REF!=\"\",\"\",\"X\")","v":{"$error":"#REF!"}}]
[null,null,null,null,null,null,null,null,null,null,null,null,null,null,null,{"$f":"IF(#REF!=\"\",\"\",IF(#REF!<TODAY(),0,IF(#REF!<(TODAY()+365),1,\"X\")))","v":{"$error":"#REF!"}},{"$f":"IF(#REF!=\"\",\"\",\"X\")","v":{"$error":"#REF!"}}]
[null,null,null,null,null,null,null,null,null,null,null,null,null,null,null,{"$f":"IF(#REF!=\"\",\"\",IF(#REF!<TODAY(),0,IF(#REF!<(TODAY()+365),1,\"X\")))","v":{"$error":"#REF!"}},{"$f":"IF(#REF!=\"\",\"\",\"X\")","v":{"$error":"#REF!"}}]
[null,null,null,null,null,null,null,null,null,null,null,null,null,null,null,{"$f":"IF(#REF!=\"\",\"\",IF(#REF!<TODAY(),0,IF(#REF!<(TODAY()+365),1,\"X\")))","v":{"$error":"#REF!"}},{"$f":"IF(#REF!=\"\",\"\",\"X\")","v":{"$error":"#REF!"}}]
[null,null,null,null,null,null,null,null,null,null,null,null,null,null,null,{"$f":"IF(#REF!=\"\",\"\",IF(#REF!<TODAY(),0,IF(#REF!<(TODAY()+365),1,\"X\")))","v":{"$error":"#REF!"}},{"$f":"IF(#REF!=\"\",\"\",\"X\")","v":{"$error":"#REF!"}}]
[null,null,null,null,null,null,null,null,null,null,null,null,null,null,null,{"$f":"IF(#REF!=\"\",\"\",IF(#REF!<TODAY(),0,IF(#REF!<(TODAY()+365),1,\"X\")))","v":{"$error":"#REF!"}},{"$f":"IF(#REF!=\"\",\"\",\"X\")","v":{"$error":"#REF!"}}]
[null,null,null,null,null,null,null,null,null,null,null,null,null,null,null,{"$f":"IF(#REF!=\"\",\"\",IF(#REF!<TODAY(),0,IF(#REF!<(TODAY()+365),1,\"X\")))","v":{"$error":"#REF!"}},{"$f":"IF(#REF!=\"\",\"\",\"X\")","v":{"$error":"#REF!"}}]
[null,null,null,null,null,null,null,null,null,null,null,null,null,null,null,{"$f":"IF(#REF!=\"\",\"\",IF(#REF!<TODAY(),0,IF(#REF!<(TODAY()+365),1,\"X\")))","v":{"$error":"#REF!"}},{"$f":"IF(#REF!=\"\",\"\",\"X\")","v":{"$error":"#REF!"}}]
[null,null,null,null,null,null,null,null,null,null,null,null,null,null,null,{"$f":"IF(#REF!=\"\",\"\",IF(#REF!<TODAY(),0,IF(#REF!<(TODAY()+365),1,\"X\")))","v":{"$error":"#REF!"}},{"$f":"IF(#REF!=\"\",\"\",\"X\")","v":{"$error":"#REF!"}}]
[null,null,null,null,null,null,null,null,null,null,null,null,null,null,null,{"$f":"IF(#REF!=\"\",\"\",IF(#REF!<TODAY(),0,IF(#REF!<(TODAY()+365),1,\"X\")))","v":{"$error":"#REF!"}},{"$f":"IF(#REF!=\"\",\"\",\"X\")","v":{"$error":"#REF!"}}]
[null,null,null,null,null,null,null,null,null,null,null,null,null,null,null,{"$f":"IF(#REF!=\"\",\"\",IF(#REF!<TODAY(),0,IF(#REF!<(TODAY()+365),1,\"X\")))","v":{"$error":"#REF!"}},{"$f":"IF(#REF!=\"\",\"\",\"X\")","v":{"$error":"#REF!"}}]
[null,null,null,null,null,null,null,null,null,null,null,null,null,null,null,{"$f":"IF(#REF!=\"\",\"\",IF(#REF!<TODAY(),0,IF(#REF!<(TODAY()+365),1,\"X\")))","v":{"$error":"#REF!"}},{"$f":"IF(#REF!=\"\",\"\",\"X\")","v":{"$error":"#REF!"}}]
[null,null,null,null,null,null,null,null,null,null,null,null,null,null,null,{"$f":"IF(#REF!=\"\",\"\",IF(#REF!<TODAY(),0,IF(#REF!<(TODAY()+365),1,\"X\")))","v":{"$error":"#REF!"}},{"$f":"IF(#REF!=\"\",\"\",\"X\")","v":{"$error":"#REF!"}}]
[null,null,null,null,null,null,null,null,null,null,null,null,null,null,null,{"$f":"IF(#REF!=\"\",\"\",IF(#REF!<TODAY(),0,IF(#REF!<(TODAY()+365),1,\"X\")))","v":{"$error":"#REF!"}},{"$f":"IF(#REF!=\"\",\"\",\"X\")","v":{"$error":"#REF!"}}]
[null,null,null,null,null,null,null,null,null,null,null,null,null,null,null,{"$f":"IF(#REF!=\"\",\"\",IF(#REF!<TODAY(),0,IF(#REF!<(TODAY()+365),1,\"X\")))","v":{"$error":"#REF!"}},{"$f":"IF(#REF!=\"\",\"\",\"X\")","v":{"$error":"#REF!"}}]
[null,null,null,null,null,null,null,null,null,null,null,null,null,null,null,{"$f":"IF(#REF!=\"\",\"\",IF(#REF!<TODAY(),0,IF(#REF!<(TODAY()+365),1,\"X\")))","v":{"$error":"#REF!"}},{"$f":"IF(#REF!=\"\",\"\",\"X\")","v":{"$error":"#REF!"}}]
[null,null,null,null,null,null,null,null,null,null,null,null,null,null,null,{"$f":"IF(#REF!=\"\",\"\",IF(#REF!<TODAY(),0,IF(#REF!<(TODAY()+365),1,\"X\")))","v":{"$error":"#REF!"}},{"$f":"IF(#REF!=\"\",\"\",\"X\")","v":{"$error":"#REF!"}}]
[null,null,null,null,null,null,null,null,null,null,null,null,null,null,null,{"$f":"IF(#REF!=\"\",\"\",IF(#REF!<TODAY(),0,IF(#REF!<(TODAY()+365),1,\"X\")))","v":{"$error":"#REF!"}},{"$f":"IF(#REF!=\"\",\"\",\"X\")","v":{"$error":"#REF!"}}]
[null,null,null,null,null,null,null,null,null,null,null,null,null,null,null,{"$f":"IF(#REF!=\"\",\"\",IF(#REF!<TODAY(),0,IF(#REF!<(TODAY()+365),1,\"X\")))","v":{"$error":"#REF!"}},{"$f":"IF(#REF!=\"\",\"\",\"X\")","v":{"$error":"#REF!"}}]
[null,null,null,null,null,null,null,null,null,null,null,null,null,null,null,{"$f":"IF(#REF!=\"\",\"\",IF(#REF!<TODAY(),0,IF(#REF!<(TODAY()+365),1,\"X\")))","v":{"$error":"#REF!"}},{"$f":"IF(#REF!=\"\",\"\",\"X\")","v":{"$error":"#REF!"}}]
[null,null,null,null,null,null,null,null,null,null,null,null,null,null,null,{"$f":"IF(#REF!=\"\",\"\",IF(#REF!<TODAY(),0,IF(#REF!<(TODAY()+365),1,\"X\")))","v":{"$error":"#REF!"}},{"$f":"IF(#REF!=\"\",\"\",\"X\")","v":{"$error":"#REF!"}}]
[null,null,null,null,null,null,null,null,null,null,null,null,null,null,null,{"$f":"IF(#REF!=\"\",\"\",IF(#REF!<TODAY(),0,IF(#REF!<(TODAY()+365),1,\"X\")))","v":{"$error":"#REF!"}},{"$f":"IF(#REF!=\"\",\"\",\"X\")","v":{"$error":"#REF!"}}]
[null,null,null,null,null,null,null,null,null,null,null,null,null,null,null,{"$f":"IF(#REF!=\"\",\"\",IF(#REF!<TODAY(),0,IF(#REF!<(TODAY()+365),1,\"X\")))","v":{"$error":"#REF!"}},{"$f":"IF(#REF!=\"\",\"\",\"X\")","v":{"$error":"#REF!"}}]
[null,null,null,null,null,null,null,null,null,null,null,null,null,null,null,{"$f":"IF(#REF!=\"\",\"\",IF(#REF!<TODAY(),0,IF(#REF!<(TODAY()+365),1,\"X\")))","v":{"$error":"#REF!"}},{"$f":"IF(#REF!=\"\",\"\",\"X\")","v":{"$error":"#REF!"}}]
[null,null,null,null,null,null,null,null,null,null,null,null,null,null,null,{"$f":"IF(#REF!=\"\",\"\",IF(#REF!<TODAY(),0,IF(#REF!<(TODAY()+365),1,\"X\")))","v":{"$error":"#REF!"}},{"$f":"IF(#REF!=\"\",\"\",\"X\")","v":{"$error":"#REF!"}}]
[null,null,null,null,null,null,null,null,null,null,null,null,null,null,null,{"$f":"IF(#REF!=\"\",\"\",IF(#REF!<TODAY(),0,IF(#REF!<(TODAY()+365),1,\"X\")))","v":{"$error":"#REF!"}},{"$f":"IF(#REF!=\"\",\"\",\"X\")","v":{"$error":"#REF!"}}]
[null,null,null,null,null,null,null,null,null,null,null,null,null,null,null,{"$f":"IF(#REF!=\"\",\"\",IF(#REF!<TODAY(),0,IF(#REF!<(TODAY()+365),1,\"X\")))","v":{"$error":"#REF!"}},{"$f":"IF(#REF!=\"\",\"\",\"X\")","v":{"$error":"#REF!"}}]
[null,null,null,null,null,null,null,null,null,null,null,null,null,null,null,{"$f":"IF(#REF!=\"\",\"\",IF(#REF!<TODAY(),0,IF(#REF!<(TODAY()+365),1,\"X\")))","v":{"$error":"#REF!"}},{"$f":"IF(#REF!=\"\",\"\",\"X\")","v":{"$error":"#REF!"}}]
[null,null,null,null,null,null,null,null,null,null,null,null,null,null,null,{"$f":"IF(#REF!=\"\",\"\",IF(#REF!<TODAY(),0,IF(#REF!<(TODAY()+365),1,\"X\")))","v":{"$error":"#REF!"}},{"$f":"IF(#REF!=\"\",\"\",\"X\")","v":{"$error":"#REF!"}}]
[null,null,null,null,null,null,null,null,null,null,null,null,null,null,null,{"$f":"IF(#REF!=\"\",\"\",IF(#REF!<TODAY(),0,IF(#REF!<(TODAY()+365),1,\"X\")))","v":{"$error":"#REF!"}},{"$f":"IF(#REF!=\"\",\"\",\"X\")","v":{"$error":"#REF!"}}]
[null,null,null,null,null,null,null,null,null,null,null,null,null,null,null,{"$f":"IF(#REF!=\"\",\"\",IF(#REF!<TODAY(),0,IF(#REF!<(TODAY()+365),1,\"X\")))","v":{"$error":"#REF!"}},{"$f":"IF(#REF!=\"\",\"\",\"X\")","v":{"$error":"#REF!"}}]
[null,null,null,null,null,null,null,null,null,null,null,null,null,null,null,{"$f":"IF(#REF!=\"\",\"\",IF(#REF!<TODAY(),0,IF(#REF!<(TODAY()+365),1,\"X\")))","v":{"$error":"#REF!"}},{"$f":"IF(#REF!=\"\",\"\",\"X\")","v":{"$error":"#REF!"}}]
[null,null,null,null,null,null,null,null,null,null,null,null,null,null,null,{"$f":"IF(#REF!=\"\",\"\",IF(#REF!<TODAY(),0,IF(#REF!<(TODAY()+365),1,\"X\")))","v":{"$error":"#REF!"}},{"$f":"IF(#REF!=\"\",\"\",\"X\")","v":{"$error":"#REF!"}}]
[null,null,null,null,null,null,null,null,null,null,null,null,null,null,null,{"$f":"IF(#REF!=\"\",\"\",IF(#REF!<TODAY(),0,IF(#REF!<(TODAY()+365),1,\"X\")))","v":{"$error":"#REF!"}},{"$f":"IF(#REF!=\"\",\"\",\"X\")","v":{"$error":"#REF!"}}]
[null,null,null,null,null,null,null,null,null,null,null,null,null,null,null,{"$f":"IF(#REF!=\"\",\"\",IF(#REF!<TODAY(),0,IF(#REF!<(TODAY()+365),1,\"X\")))","v":{"$error":"#REF!"}},{"$f":"IF(#REF!=\"\",\"\",\"X\")","v":{"$error":"#REF!"}}]
[null,null,null,null,null,null,null,null,null,null,null,null,null,null,null,{"$f":"IF(#REF!=\"\",\"\",IF(#REF!<TODAY(),0,IF(#REF!<(TODAY()+365),1,\"X\")))","v":{"$error":"#REF!"}},{"$f":"IF(#REF!=\"\",\"\",\"X\")","v":{"$error":"#REF!"}}]
[null,null,null,null,null,null,null,null,null,null,null,null,null,null,null,{"$f":"IF(#REF!=\"\",\"\",IF(#REF!<TODAY(),0,IF(#REF!<(TODAY()+365),1,\"X\")))","v":{"$error":"#REF!"}},{"$f":"IF(#REF!=\"\",\"\",\"X\")","v":{"$error":"#REF!"}}]
[null,null,null,null,null,null,null,null,null,null,null,null,null,null,null,{"$f":"IF(#REF!=\"\",\"\",IF(#REF!<TODAY(),0,IF(#REF!<(TODAY()+365),1,\"X\")))","v":{"$error":"#REF!"}},{"$f":"IF(#REF!=\"\",\"\",\"X\")","v":{"$error":"#REF!"}}]
[null,null,null,null,null,null,null,null,null,null,null,null,null,null,null,{"$f":"IF(#REF!=\"\",\"\",IF(#REF!<TODAY(),0,IF(#REF!<(TODAY()+365),1,\"X\")))","v":{"$error":"#REF!"}},{"$f":"IF(#REF!=\"\",\"\",\"X\")","v":{"$error":"#REF!"}}]
[null,null,null,null,null,null,null,null,null,null,null,null,null,null,null,{"$f":"IF(#REF!=\"\",\"\",IF(#REF!<TODAY(),0,IF(#REF!<(TODAY()+365),1,\"X\")))","v":{"$error":"#REF!"}},{"$f":"IF(#REF!=\"\",\"\",\"X\")","v":{"$error":"#REF!"}}]
[null,null,null,null,null,null,null,null,null,null,null,null,null,null,null,{"$f":"IF(#REF!=\"\",\"\",IF(#REF!<TODAY(),0,IF(#REF!<(TODAY()+365),1,\"X\")))","v":{"$error":"#REF!"}},{"$f":"IF(#REF!=\"\",\"\",\"X\")","v":{"$error":"#REF!"}}]
[null,null,null,null,null,null,null,null,null,null,null,null,null,null,null,{"$f":"IF(#REF!=\"\",\"\",IF(#REF!<TODAY(),0,IF(#REF!<(TODAY()+365),1,\"X\")))","v":{"$error":"#REF!"}},{"$f":"IF(#REF!=\"\",\"\",\"X\")","v":{"$error":"#REF!"}}]
[null,null,null,null,null,null,null,null,null,null,null,null,null,null,null,{"$f":"IF(#REF!=\"\",\"\",IF(#REF!<TODAY(),0,IF(#REF!<(TODAY()+365),1,\"X\")))","v":{"$error":"#REF!"}},{"$f":"IF(#REF!=\"\",\"\",\"X\")","v":{"$error":"#REF!"}}]
[null,null,null,null,null,null,null,null,null,null,null,null,null,null,null,{"$f":"IF(#REF!=\"\",\"\",IF(#REF!<TODAY(),0,IF(#REF!<(TODAY()+365),1,\"X\")))","v":{"$error":"#REF!"}},{"$f":"IF(#REF!=\"\",\"\",\"X\")","v":{"$error":"#REF!"}}]
[null,null,null,null,null,null,null,null,null,null,null,null,null,null,null,{"$f":"IF(#REF!=\"\",\"\",IF(#REF!<TODAY(),0,IF(#REF!<(TODAY()+365),1,\"X\")))","v":{"$error":"#REF!"}},{"$f":"IF(#REF!=\"\",\"\",\"X\")","v":{"$error":"#REF!"}}]
[null,null,null,null,null,null,null,null,null,null,null,null,null,null,null,{"$f":"IF(#REF!=\"\",\"\",IF(#REF!<TODAY(),0,IF(#REF!<(TODAY()+365),1,\"X\")))","v":{"$error":"#REF!"}},{"$f":"IF(#REF!=\"\",\"\",\"X\")","v":{"$error":"#REF!"}}]
[null,null,null,null,null,null,null,null,null,null,null,null,null,null,null,{"$f":"IF(#REF!=\"\",\"\",IF(#REF!<TODAY(),0,IF(#REF!<(TODAY()+365),1,\"X\")))","v":{"$error":"#REF!"}},{"$f":"IF(#REF!=\"\",\"\",\"X\")","v":{"$error":"#REF!"}}]
[null,null,null,null,null,null,null,null,null,null,null,null,null,null,null,{"$f":"IF(#REF!=\"\",\"\",IF(#REF!<TODAY(),0,IF(#REF!<(TODAY()+365),1,\"X\")))","v":{"$error":"#REF!"}},{"$f":"IF(#REF!=\"\",\"\",\"X\")","v":{"$error":"#REF!"}}]
[null,null,null,null,null,null,null,null,null,null,null,null,null,null,null,{"$f":"IF(#REF!=\"\",\"\",IF(#REF!<TODAY(),0,IF(#REF!<(TODAY()+365),1,\"X\")))","v":{"$error":"#REF!"}},{"$f":"IF(#REF!=\"\",\"\",\"X\")","v":{"$error":"#REF!"}}]
[null,null,null,null,null,null,null,null,null,null,null,null,null,null,null,{"$f":"IF(#REF!=\"\",\"\",IF(#REF!<TODAY(),0,IF(#REF!<(TODAY()+365),1,\"X\")))","v":{"$error":"#REF!"}},{"$f":"IF(#REF!=\"\",\"\",\"X\")","v":{"$error":"#REF!"}}]
[null,null,null,null,null,null,null,null,null,null,null,null,null,null,null,{"$f":"IF(#REF!=\"\",\"\",IF(#REF!<TODAY(),0,IF(#REF!<(TODAY()+365),1,\"X\")))","v":{"$error":"#REF!"}},{"$f":"IF(#REF!=\"\",\"\",\"X\")","v":{"$error":"#REF!"}}]
[null,null,null,null,null,null,null,null,null,null,null,null,null,null,null,{"$f":"IF(#REF!=\"\",\"\",IF(#REF!<TODAY(),0,IF(#REF!<(TODAY()+365),1,\"X\")))","v":{"$error":"#REF!"}},{"$f":"IF(#REF!=\"\",\"\",\"X\")","v":{"$error":"#REF!"}}]
[null,null,null,null,null,null,null,null,null,null,null,null,null,null,null,{"$f":"IF(#REF!=\"\",\"\",IF(#REF!<TODAY(),0,IF(#REF!<(TODAY()+365),1,\"X\")))","v":{"$error":"#REF!"}},{"$f":"IF(#REF!=\"\",\"\",\"X\")","v":{"$error":"#REF!"}}]
[null,null,null,null,null,null,null,null,null,null,null,null,null,null,null,{"$f":"IF(#REF!=\"\",\"\",IF(#REF!<TODAY(),0,IF(#REF!<(TODAY()+365),1,\"X\")))","v":{"$error":"#REF!"}},{"$f":"IF(#REF!=\"\",\"\",\"X\")","v":{"$error":"#REF!"}}]
[null,null,null,null,null,null,null,null,null,null,null,null,null,null,null,{"$f":"IF(#REF!=\"\",\"\",IF(#REF!<TODAY(),0,IF(#REF!<(TODAY()+365),1,\"X\")))","v":{"$error":"#REF!"}},{"$f":"IF(#REF!=\"\",\"\",\"X\")","v":{"$error":"#REF!"}}]
[null,null,null,null,null,null,null,null,null,null,null,null,null,null,null,{"$f":"IF(#REF!=\"\",\"\",IF(#REF!<TODAY(),0,IF(#REF!<(TODAY()+365),1,\"X\")))","v":{"$error":"#REF!"}},{"$f":"IF(#REF!=\"\",\"\",\"X\")","v":{"$error":"#REF!"}}]
[null,null,null,null,null,null,null,null,null,null,null,null,null,null,null,{"$f":"IF(#REF!=\"\",\"\",IF(#REF!<TODAY(),0,IF(#REF!<(TODAY()+365),1,\"X\")))","v":{"$error":"#REF!"}},{"$f":"IF(#REF!=\"\",\"\",\"X\")","v":{"$error":"#REF!"}}]
[null,null,null,null,null,null,null,null,null,null,null,null,null,null,null,{"$f":"IF(#REF!=\"\",\"\",IF(#REF!<TODAY(),0,IF(#REF!<(TODAY()+365),1,\"X\")))","v":{"$error":"#REF!"}},{"$f":"IF(#REF!=\"\",\"\",\"X\")","v":{"$error":"#REF!"}}]
[null,null,null,null,null,null,null,null,null,null,null,null,null,null,null,{"$f":"IF(#REF!=\"\",\"\",IF(#REF!<TODAY(),0,IF(#REF!<(TODAY()+365),1,\"X\")))","v":{"$error":"#REF!"}},{"$f":"IF(#REF!=\"\",\"\",\"X\")","v":{"$error":"#REF!"}}]
[null,null,null,null,null,null,null,null,null,null,null,null,null,null,null,{"$f":"IF(#REF!=\"\",\"\",IF(#REF!<TODAY(),0,IF(#REF!<(TODAY()+365),1,\"X\")))","v":{"$error":"#REF!"}},{"$f":"IF(#REF!=\"\",\"\",\"X\")","v":{"$error":"#REF!"}}]
[null,null,null,null,null,null,null,null,null,null,null,null,null,null,null,{"$f":"IF(#REF!=\"\",\"\",IF(#REF!<TODAY(),0,IF(#REF!<(TODAY()+365),1,\"X\")))","v":{"$error":"#REF!"}},{"$f":"IF(#REF!=\"\",\"\",\"X\")","v":{"$error":"#REF!"}}]
[null,null,null,null,null,null,null,null,null,null,null,null,null,null,null,{"$f":"IF(#REF!=\"\",\"\",IF(#REF!<TODAY(),0,IF(#REF!<(TODAY()+365),1,\"X\")))","v":{"$error":"#REF!"}},{"$f":"IF(#REF!=\"\",\"\",\"X\")","v":{"$error":"#REF!"}}]
[null,null,null,null,null,null,null,null,null,null,null,null,null,null,null,{"$f":"IF(#REF!=\"\",\"\",IF(#REF!<TODAY(),0,IF(#REF!<(TODAY()+365),1,\"X\")))","v":{"$error":"#REF!"}},{"$f":"IF(#REF!=\"\",\"\",\"X\")","v":{"$error":"#REF!"}}]
[null,null,null,null,null,null,null,null,null,null,null,null,null,null,null,{"$f":"IF(#REF!=\"\",\"\",IF(#REF!<TODAY(),0,IF(#REF!<(TODAY()+365),1,\"X\")))","v":{"$error":"#REF!"}},{"$f":"IF(#REF!=\"\",\"\",\"X\")","v":{"$error":"#REF!"}}]
[null,null,null,null,null,null,null,null,null,null,null,null,null,null,null,{"$f":"IF(#REF!=\"\",\"\",IF(#REF!<TODAY(),0,IF(#REF!<(TODAY()+365),1,\"X\")))","v":{"$error":"#REF!"}},{"$f":"IF(#REF!=\"\",\"\",\"X\")","v":{"$error":"#REF!"}}]
[null,null,null,null,null,null,null,null,null,null,null,null,null,null,null,{"$f":"IF(#REF!=\"\",\"\",IF(#REF!<TODAY(),0,IF(#REF!<(TODAY()+365),1,\"X\")))","v":{"$error":"#REF!"}},{"$f":"IF(#REF!=\"\",\"\",\"X\")","v":{"$error":"#REF!"}}]
[null,null,null,null,null,null,null,null,null,null,null,null,null,null,null,{"$f":"IF(#REF!=\"\",\"\",IF(#REF!<TODAY(),0,IF(#REF!<(TODAY()+365),1,\"X\")))","v":{"$error":"#REF!"}},{"$f":"IF(#REF!=\"\",\"\",\"X\")","v":{"$error":"#REF!"}}]
[null,null,null,null,null,null,null,null,null,null,null,null,null,null,null,{"$f":"IF(#REF!=\"\",\"\",IF(#REF!<TODAY(),0,IF(#REF!<(TODAY()+365),1,\"X\")))","v":{"$error":"#REF!"}},{"$f":"IF(#REF!=\"\",\"\",\"X\")","v":{"$error":"#REF!"}}]
[null,null,null,null,null,null,null,null,null,null,null,null,null,null,null,{"$f":"IF(#REF!=\"\",\"\",IF(#REF!<TODAY(),0,IF(#REF!<(TODAY()+365),1,\"X\")))","v":{"$error":"#REF!"}},{"$f":"IF(#REF!=\"\",\"\",\"X\")","v":{"$error":"#REF!"}}]
[null,null,null,null,null,null,null,null,null,null,null,null,null,null,null,{"$f":"IF(#REF!=\"\",\"\",IF(#REF!<TODAY(),0,IF(#REF!<(TODAY()+365),1,\"X\")))","v":{"$error":"#REF!"}},{"$f":"IF(#REF!=\"\",\"\",\"X\")","v":{"$error":"#REF!"}}]
[null,null,null,null,null,null,null,null,null,null,null,null,null,null,null,{"$f":"IF(#REF!=\"\",\"\",IF(#REF!<TODAY(),0,IF(#REF!<(TODAY()+365),1,\"X\")))","v":{"$error":"#REF!"}},{"$f":"IF(#REF!=\"\",\"\",\"X\")","v":{"$error":"#REF!"}}]
[null,null,null,null,null,null,null,null,null,null,null,null,null,null,null,{"$f":"IF(#REF!=\"\",\"\",IF(#REF!<TODAY(),0,IF(#REF!<(TODAY()+365),1,\"X\")))","v":{"$error":"#REF!"}},{"$f":"IF(#REF!=\"\",\"\",\"X\")","v":{"$error":"#REF!"}}]
[null,null,null,null,null,null,null,null,null,null,null,null,null,null,null,{"$f":"IF(#REF!=\"\",\"\",IF(#REF!<TODAY(),0,IF(#REF!<(TODAY()+365),1,\"X\")))","v":{"$error":"#REF!"}},{"$f":"IF(#REF!=\"\",\"\",\"X\")","v":{"$error":"#REF!"}}]
[null,null,null,null,null,null,null,null,null,null,null,null,null,null,null,{"$f":"IF(#REF!=\"\",\"\",IF(#REF!<TODAY(),0,IF(#REF!<(TODAY()+365),1,\"X\")))","v":{"$error":"#REF!"}},{"$f":"IF(#REF!=\"\",\"\",\"X\")","v":{"$error":"#REF!"}}]
[null,null,null,null,null,null,null,null,null,null,null,null,null,null,null,{"$f":"IF(#REF!=\"\",\"\",IF(#REF!<TODAY(),0,IF(#REF!<(TODAY()+365),1,\"X\")))","v":{"$error":"#REF!"}},{"$f":"IF(#REF!=\"\",\"\",\"X\")","v":{"$error":"#REF!"}}]
[null,null,null,null,null,null,null,null,null,null,null,null,null,null,null,{"$f":"IF(#REF!=\"\",\"\",IF(#REF!<TODAY(),0,IF(#REF!<(TODAY()+365),1,\"X\")))","v":{"$error":"#REF!"}},{"$f":"IF(#REF!=\"\",\"\",\"X\")","v":{"$error":"#REF!"}}]
[null,null,null,null,null,null,null,null,null,null,null,null,null,null,null,{"$f":"IF(#REF!=\"\",\"\",IF(#REF!<TODAY(),0,IF(#REF!<(TODAY()+365),1,\"X\")))","v":{"$error":"#REF!"}},{"$f":"IF(#REF!=\"\",\"\",\"X\")","v":{"$error":"#REF!"}}]
[null,null,null,null,null,null,null,null,null,null,null,null,null,null,null,{"$f":"IF(#REF!=\"\",\"\",IF(#REF!<TODAY(),0,IF(#REF!<(TODAY()+365),1,\"X\")))","v":{"$error":"#REF!"}},{"$f":"IF(#REF!=\"\",\"\",\"X\")","v":{"$error":"#REF!"}}]
[null,null,null,null,null,null,null,null,null,null,null,null,null,null,null,{"$f":"IF(#REF!=\"\",\"\",IF(#REF!<TODAY(),0,IF(#REF!<(TODAY()+365),1,\"X\")))","v":{"$error":"#REF!"}},{"$f":"IF(#REF!=\"\",\"\",\"X\")","v":{"$error":"#REF!"}}]
[null,null,null,null,null,null,null,null,null,null,null,null,null,null,null,{"$f":"IF(#REF!=\"\",\"\",IF(#REF!<TODAY(),0,IF(#REF!<(TODAY()+365),1,\"X\")))","v":{"$error":"#REF!"}},{"$f":"IF(#REF!=\"\",\"\",\"X\")","v":{"$error":"#REF!"}}]
[null,null,null,null,null,null,null,null,null,null,null,null,null,null,null,{"$f":"IF(#REF!=\"\",\"\",IF(#REF!<TODAY(),0,IF(#REF!<(TODAY()+365),1,\"X\")))","v":{"$error":"#REF!"}},{"$f":"IF(#REF!=\"\",\"\",\"X\")","v":{"$error":"#REF!"}}]
[null,null,null,null,null,null,null,null,null,null,null,null,null,null,null,{"$f":"IF(#REF!=\"\",\"\",IF(#REF!<TODAY(),0,IF(#REF!<(TODAY()+365),1,\"X\")))","v":{"$error":"#REF!"}},{"$f":"IF(#REF!=\"\",\"\",\"X\")","v":{"$error":"#REF!"}}]
[null,null,null,null,null,null,null,null,null,null,null,null,null,null,null,{"$f":"IF(#REF!=\"\",\"\",IF(#REF!<TODAY(),0,IF(#REF!<(TODAY()+365),1,\"X\")))","v":{"$error":"#REF!"}},{"$f":"IF(#REF!=\"\",\"\",\"X\")","v":{"$error":"#REF!"}}]
[null,null,null,null,null,null,null,null,null,null,null,null,null,null,null,{"$f":"IF(#REF!=\"\",\"\",IF(#REF!<TODAY(),0,IF(#REF!<(TODAY()+365),1,\"X\")))","v":{"$error":"#REF!"}},{"$f":"IF(#REF!=\"\",\"\",\"X\")","v":{"$error":"#REF!"}}]
[null,null,null,null,null,null,null,null,null,null,null,null,null,null,null,{"$f":"IF(#REF!=\"\",\"\",IF(#REF!<TODAY(),0,IF(#REF!<(TODAY()+365),1,\"X\")))","v":{"$error":"#REF!"}},{"$f":"IF(#REF!=\"\",\"\",\"X\")","v":{"$error":"#REF!"}}]
[null,null,null,null,null,null,null,null,null,null,null,null,null,null,null,{"$f":"IF(#REF!=\"\",\"\",IF(#REF!<TODAY(),0,IF(#REF!<(TODAY()+365),1,\"X\")))","v":{"$error":"#REF!"}},{"$f":"IF(#REF!=\"\",\"\",\"X\")","v":{"$error":"#REF!"}}]
[null,null,null,null,null,null,null,null,null,null,null,null,null,null,null,{"$f":"IF(#REF!=\"\",\"\",IF(#REF!<TODAY(),0,IF(#REF!<(TODAY()+365),1,\"X\")))","v":{"$error":"#REF!"}},{"$f":"IF(#REF!=\"\",\"\",\"X\")","v":{"$error":"#REF!"}}]
[null,null,null,null,null,null,null,null,null,null,null,null,null,null,null,{"$f":"IF(#REF!=\"\",\"\",IF(#REF!<TODAY(),0,IF(#REF!<(TODAY()+365),1,\"X\")))","v":{"$error":"#REF!"}},{"$f":"IF(#REF!=\"\",\"\",\"X\")","v":{"$error":"#REF!"}}]
[null,null,null,null,null,null,null,null,null,null,null,null,null,null,null,{"$f":"IF(#REF!=\"\",\"\",IF(#REF!<TODAY(),0,IF(#REF!<(TODAY()+365),1,\"X\")))","v":{"$error":"#REF!"}},{"$f":"IF(#REF!=\"\",\"\",\"X\")","v":{"$error":"#REF!"}}]
[null,null,null,null,null,null,null,null,null,null,null,null,null,null,null,{"$f":"IF(#REF!=\"\",\"\",IF(#REF!<TODAY(),0,IF(#REF!<(TODAY()+365),1,\"X\")))","v":{"$error":"#REF!"}},{"$f":"IF(#REF!=\"\",\"\",\"X\")","v":{"$error":"#REF!"}}]
[null,null,null,null,null,null,null,null,null,null,null,null,null,null,null,{"$f":"IF(#REF!=\"\",\"\",IF(#REF!<TODAY(),0,IF(#REF!<(TODAY()+365),1,\"X\")))","v":{"$error":"#REF!"}},{"$f":"IF(#REF!=\"\",\"\",\"X\")","v":{"$error":"#REF!"}}]
[null,null,null,null,null,null,null,null,null,null,null,null,null,null,null,{"$f":"IF(#REF!=\"\",\"\",IF(#REF!<TODAY(),0,IF(#REF!<(TODAY()+365),1,\"X\")))","v":{"$error":"#REF!"}},{"$f":"IF(#REF!=\"\",\"\",\"X\")","v":{"$error":"#REF!"}}]
[null,null,null,null,null,null,null,null,null,null,null,null,null,null,null,{"$f":"IF(#REF!=\"\",\"\",IF(#REF!<TODAY(),0,IF(#REF!<(TODAY()+365),1,\"X\")))","v":{"$error":"#REF!"}},{"$f":"IF(#REF!=\"\",\"\",\"X\")","v":{"$error":"#REF!"}}]
[null,null,null,null,null,null,null,null,null,null,null,null,null,null,null,{"$f":"IF(#REF!=\"\",\"\",IF(#REF!<TODAY(),0,IF(#REF!<(TODAY()+365),1,\"X\")))","v":{"$error":"#REF!"}},{"$f":"IF(#REF!=\"\",\"\",\"X\")","v":{"$error":"#REF!"}}]
[null,null,null,null,null,null,null,null,null,null,null,null,null,null,null,{"$f":"IF(#REF!=\"\",\"\",IF(#REF!<TODAY(),0,IF(#REF!<(TODAY()+365),1,\"X\")))","v":{"$error":"#REF!"}},{"$f":"IF(#REF!=\"\",\"\",\"X\")","v":{"$error":"#REF!"}}]
[null,null,null,null,null,null,null,null,null,null,null,null,null,null,null,{"$f":"IF(#REF!=\"\",\"\",IF(#REF!<TODAY(),0,IF(#REF!<(TODAY()+365),1,\"X\")))","v":{"$error":"#REF!"}},{"$f":"IF(#REF!=\"\",\"\",\"X\")","v":{"$error":"#REF!"}}]
[null,null,null,null,null,null,null,null,null,null,null,null,null,null,null,{"$f":"IF(#REF!=\"\",\"\",IF(#REF!<TODAY(),0,IF(#REF!<(TODAY()+365),1,\"X\")))","v":{"$error":"#REF!"}},{"$f":"IF(#REF!=\"\",\"\",\"X\")","v":{"$error":"#REF!"}}]
[null,null,null,null,null,null,null,null,null,null,null,null,null,null,null,{"$f":"IF(#REF!=\"\",\"\",IF(#REF!<TODAY(),0,IF(#REF!<(TODAY()+365),1,\"X\")))","v":{"$error":"#REF!"}},{"$f":"IF(#REF!=\"\",\"\",\"X\")","v":{"$error":"#REF!"}}]
[null,null,null,null,null,null,null,null,null,null,null,null,null,null,null,{"$f":"IF(#REF!=\"\",\"\",IF(#REF!<TODAY(),0,IF(#REF!<(TODAY()+365),1,\"X\")))","v":{"$error":"#REF!"}},{"$f":"IF(#REF!=\"\",\"\",\"X\")","v":{"$error":"#REF!"}}]
[null,null,null,null,null,null,null,null,null,null,null,null,null,null,null,{"$f":"IF(#REF!=\"\",\"\",IF(#REF!<TODAY(),0,IF(#REF!<(TODAY()+365),1,\"X\")))","v":{"$error":"#REF!"}},{"$f":"IF(#REF!=\"\",\"\",\"X\")","v":{"$error":"#REF!"}}]
[null,null,null,null,null,null,null,null,null,null,null,null,null,null,null,{"$f":"IF(#REF!=\"\",\"\",IF(#REF!<TODAY(),0,IF(#REF!<(TODAY()+365),1,\"X\")))","v":{"$error":"#REF!"}},{"$f":"IF(#REF!=\"\",\"\",\"X\")","v":{"$error":"#REF!"}}]
[null,null,null,null,null,null,null,null,null,null,null,null,null,null,null,{"$f":"IF(#REF!=\"\",\"\",IF(#REF!<TODAY(),0,IF(#REF!<(TODAY()+365),1,\"X\")))","v":{"$error":"#REF!"}},{"$f":"IF(#REF!=\"\",\"\",\"X\")","v":{"$error":"#REF!"}}]
[null,null,null,null,null,null,null,null,null,null,null,null,null,null,null,{"$f":"IF(#REF!=\"\",\"\",IF(#REF!<TODAY(),0,IF(#REF!<(TODAY()+365),1,\"X\")))","v":{"$error":"#REF!"}},{"$f":"IF(#REF!=\"\",\"\",\"X\")","v":{"$error":"#REF!"}}]
[null,null,null,null,null,null,null,null,null,null,null,null,null,null,null,{"$f":"IF(#REF!=\"\",\"\",IF(#REF!<TODAY(),0,IF(#REF!<(TODAY()+365),1,\"X\")))","v":{"$error":"#REF!"}},{"$f":"IF(#REF!=\"\",\"\",\"X\")","v":{"$error":"#REF!"}}]
[null,null,null,null,null,null,null,null,null,null,null,null,null,null,null,{"$f":"IF(#REF!=\"\",\"\",IF(#REF!<TODAY(),0,IF(#REF!<(TODAY()+365),1,\"X\")))","v":{"$error":"#REF!"}},{"$f":"IF(#REF!=\"\",\"\",\"X\")","v":{"$error":"#REF!"}}]
[null,null,null,null,null,null,null,null,null,null,null,null,null,null,null,{"$f":"IF(#REF!=\"\",\"\",IF(#REF!<TODAY(),0,IF(#REF!<(TODAY()+365),1,\"X\")))","v":{"$error":"#REF!"}},{"$f":"IF(#REF!=\"\",\"\",\"X\")","v":{"$error":"#REF!"}}]
[null,null,null,null,null,null,null,null,null,null,null,null,null,null,null,{"$f":"IF(#REF!=\"\",\"\",IF(#REF!<TODAY(),0,IF(#REF!<(TODAY()+365),1,\"X\")))","v":{"$error":"#REF!"}},{"$f":"IF(#REF!=\"\",\"\",\"X\")","v":{"$error":"#REF!"}}]
[null,null,null,null,null,null,null,null,null,null,null,null,null,null,null,{"$f":"IF(#REF!=\"\",\"\",IF(#REF!<TODAY(),0,IF(#REF!<(TODAY()+365),1,\"X\")))","v":{"$error":"#REF!"}},{"$f":"IF(#REF!=\"\",\"\",\"X\")","v":{"$error":"#REF!"}}]
[null,null,null,null,null,null,null,null,null,null,null,null,null,null,null,{"$f":"IF(#REF!=\"\",\"\",IF(#REF!<TODAY(),0,IF(#REF!<(TODAY()+365),1,\"X\")))","v":{"$error":"#REF!"}},{"$f":"IF(#REF!=\"\",\"\",\"X\")","v":{"$error":"#REF!"}}]
[null,null,null,null,null,null,null,null,null,null,null,null,null,null,null,{"$f":"IF(#REF!=\"\",\"\",IF(#REF!<TODAY(),0,IF(#REF!<(TODAY()+365),1,\"X\")))","v":{"$error":"#REF!"}},{"$f":"IF(#REF!=\"\",\"\",\"X\")","v":{"$error":"#REF!"}}]
[null,null,null,null,null,null,null,null,null,null,null,null,null,null,null,{"$f":"IF(#REF!=\"\",\"\",IF(#REF!<TODAY(),0,IF(#REF!<(TODAY()+365),1,\"X\")))","v":{"$error":"#REF!"}},{"$f":"IF(#REF!=\"\",\"\",\"X\")","v":{"$error":"#REF!"}}]
[null,null,null,null,null,null,null,null,null,null,null,null,null,null,null,{"$f":"IF(#REF!=\"\",\"\",IF(#REF!<TODAY(),0,IF(#REF!<(TODAY()+365),1,\"X\")))","v":{"$error":"#REF!"}},{"$f":"IF(#REF!=\"\",\"\",\"X\")","v":{"$error":"#REF!"}}]
[null,null,null,null,null,null,null,null,null,null,null,null,null,null,null,{"$f":"IF(#REF!=\"\",\"\",IF(#REF!<TODAY(),0,IF(#REF!<(TODAY()+365),1,\"X\")))","v":{"$error":"#REF!"}},{"$f":"IF(#REF!=\"\",\"\",\"X\")","v":{"$error":"#REF!"}}]
[null,null,null,null,null,null,null,null,null,null,null,null,null,null,null,{"$f":"IF(#REF!=\"\",\"\",IF(#REF!<TODAY(),0,IF(#REF!<(TODAY()+365),1,\"X\")))","v":{"$error":"#REF!"}},{"$f":"IF(#REF!=\"\",\"\",\"X\")","v":{"$error":"#REF!"}}]
[null,null,null,null,null,null,null,null,null,null,null,null,null,null,null,{"$f":"IF(#REF!=\"\",\"\",IF(#REF!<TODAY(),0,IF(#REF!<(TODAY()+365),1,\"X\")))","v":{"$error":"#REF!"}},{"$f":"IF(#REF!=\"\",\"\",\"X\")","v":{"$error":"#REF!"}}]
[null,null,null,null,null,null,null,null,null,null,null,null,null,null,null,{"$f":"IF(#REF!=\"\",\"\",IF(#REF!<TODAY(),0,IF(#REF!<(TODAY()+365),1,\"X\")))","v":{"$error":"#REF!"}},{"$f":"IF(#REF!=\"\",\"\",\"X\")","v":{"$error":"#REF!"}}]
[null,null,null,null,null,null,null,null,null,null,null,null,null,null,null,{"$f":"IF(#REF!=\"\",\"\",IF(#REF!<TODAY(),0,IF(#REF!<(TODAY()+365),1,\"X\")))","v":{"$error":"#REF!"}},{"$f":"IF(#REF!=\"\",\"\",\"X\")","v":{"$error":"#REF!"}}]
[null,null,null,null,null,null,null,null,null,null,null,null,null,null,null,{"$f":"IF(#REF!=\"\",\"\",IF(#REF!<TODAY(),0,IF(#REF!<(TODAY()+365),1,\"X\")))","v":{"$error":"#REF!"}},{"$f":"IF(#REF!=\"\",\"\",\"X\")","v":{"$error":"#REF!"}}]
[null,null,null,null,null,null,null,null,null,null,null,null,null,null,null,{"$f":"IF(#REF!=\"\",\"\",IF(#REF!<TODAY(),0,IF(#REF!<(TODAY()+365),1,\"X\")))","v":{"$error":"#REF!"}},{"$f":"IF(#REF!=\"\",\"\",\"X\")","v":{"$error":"#REF!"}}]
[null,null,null,null,null,null,null,null,null,null,null,null,null,null,null,{"$f":"IF(#REF!=\"\",\"\",IF(#REF!<TODAY(),0,IF(#REF!<(TODAY()+365),1,\"X\")))","v":{"$error":"#REF!"}},{"$f":"IF(#REF!=\"\",\"\",\"X\")","v":{"$error":"#REF!"}}]
[null,null,null,null,null,null,null,null,null,null,null,null,null,null,null,{"$f":"IF(#REF!=\"\",\"\",IF(#REF!<TODAY(),0,IF(#REF!<(TODAY()+365),1,\"X\")))","v":{"$error":"#REF!"}},{"$f":"IF(#REF!=\"\",\"\",\"X\")","v":{"$error":"#REF!"}}]
[null,null,null,null,null,null,null,null,null,null,null,null,null,null,null,{"$f":"IF(#REF!=\"\",\"\",IF(#REF!<TODAY(),0,IF(#REF!<(TODAY()+365),1,\"X\")))","v":{"$error":"#REF!"}},{"$f":"IF(#REF!=\"\",\"\",\"X\")","v":{"$error":"#REF!"}}]
[null,null,null,null,null,null,null,null,null,null,null,null,null,null,null,{"$f":"IF(#REF!=\"\",\"\",IF(#REF!<TODAY(),0,IF(#REF!<(TODAY()+365),1,\"X\")))","v":{"$error":"#REF!"}},{"$f":"IF(#REF!=\"\",\"\",\"X\")","v":{"$error":"#REF!"}}]
[null,null,null,null,null,null,null,null,null,null,null,null,null,null,null,{"$f":"IF(#REF!=\"\",\"\",IF(#REF!<TODAY(),0,IF(#REF!<(TODAY()+365),1,\"X\")))","v":{"$error":"#REF!"}},{"$f":"IF(#REF!=\"\",\"\",\"X\")","v":{"$error":"#REF!"}}]
[null,null,null,null,null,null,null,null,null,null,null,null,null,null,null,{"$f":"IF(#REF!=\"\",\"\",IF(#REF!<TODAY(),0,IF(#REF!<(TODAY()+365),1,\"X\")))","v":{"$error":"#REF!"}},{"$f":"IF(#REF!=\"\",\"\",\"X\")","v":{"$error":"#REF!"}}]
[null,null,null,null,null,null,null,null,null,null,null,null,null,null,null,{"$f":"IF(#REF!=\"\",\"\",IF(#REF!<TODAY(),0,IF(#REF!<(TODAY()+365),1,\"X\")))","v":{"$error":"#REF!"}},{"$f":"IF(#REF!=\"\",\"\",\"X\")","v":{"$error":"#REF!"}}]
[null,null,null,null,null,null,null,null,null,null,null,null,null,null,null,{"$f":"IF(#REF!=\"\",\"\",IF(#REF!<TODAY(),0,IF(#REF!<(TODAY()+365),1,\"X\")))","v":{"$error":"#REF!"}},{"$f":"IF(#REF!=\"\",\"\",\"X\")","v":{"$error":"#REF!"}}]
[null,null,null,null,null,null,null,null,null,null,null,null,null,null,null,{"$f":"IF(#REF!=\"\",\"\",IF(#REF!<TODAY(),0,IF(#REF!<(TODAY()+365),1,\"X\")))","v":{"$error":"#REF!"}},{"$f":"IF(#REF!=\"\",\"\",\"X\")","v":{"$error":"#REF!"}}]
[null,null,null,null,null,null,null,null,null,null,null,null,null,null,null,{"$f":"IF(#REF!=\"\",\"\",IF(#REF!<TODAY(),0,IF(#REF!<(TODAY()+365),1,\"X\")))","v":{"$error":"#REF!"}},{"$f":"IF(#REF!=\"\",\"\",\"X\")","v":{"$error":"#REF!"}}]
[null,null,null,null,null,null,null,null,null,null,null,null,null,null,null,{"$f":"IF(#REF!=\"\",\"\",IF(#REF!<TODAY(),0,IF(#REF!<(TODAY()+365),1,\"X\")))","v":{"$error":"#REF!"}},{"$f":"IF(#REF!=\"\",\"\",\"X\")","v":{"$error":"#REF!"}}]
[null,null,null,null,null,null,null,null,null,null,null,null,null,null,null,{"$f":"IF(#REF!=\"\",\"\",IF(#REF!<TODAY(),0,IF(#REF!<(TODAY()+365),1,\"X\")))","v":{"$error":"#REF!"}},{"$f":"IF(#REF!=\"\",\"\",\"X\")","v":{"$error":"#REF!"}}]
[null,null,null,null,null,null,null,null,null,null,null,null,null,null,null,{"$f":"IF(#REF!=\"\",\"\",IF(#REF!<TODAY(),0,IF(#REF!<(TODAY()+365),1,\"X\")))","v":{"$error":"#REF!"}},{"$f":"IF(#REF!=\"\",\"\",\"X\")","v":{"$error":"#REF!"}}]
[null,null,null,null,null,null,null,null,null,null,null,null,null,null,null,{"$f":"IF(#REF!=\"\",\"\",IF(#REF!<TODAY(),0,IF(#REF!<(TODAY()+365),1,\"X\")))","v":{"$error":"#REF!"}},{"$f":"IF(#REF!=\"\",\"\",\"X\")","v":{"$error":"#REF!"}}]
[null,null,null,null,null,null,null,null,null,null,null,null,null,null,null,{"$f":"IF(#REF!=\"\",\"\",IF(#REF!<TODAY(),0,IF(#REF!<(TODAY()+365),1,\"X\")))","v":{"$error":"#REF!"}},{"$f":"IF(#REF!=\"\",\"\",\"X\")","v":{"$error":"#REF!"}}]
[null,null,null,null,null,null,null,null,null,null,null,null,null,null,null,{"$f":"IF(#REF!=\"\",\"\",IF(#REF!<TODAY(),0,IF(#REF!<(TODAY()+365),1,\"X\")))","v":{"$error":"#REF!"}},{"$f":"IF(#REF!=\"\",\"\",\"X\")","v":{"$error":"#REF!"}}]
[null,null,null,null,null,null,null,null,null,null,null,null,null,null,null,{"$f":"IF(#REF!=\"\",\"\",IF(#REF!<TODAY(),0,IF(#REF!<(TODAY()+365),1,\"X\")))","v":{"$error":"#REF!"}},{"$f":"IF(#REF!=\"\",\"\",\"X\")","v":{"$error":"#REF!"}}]
[null,null,null,null,null,null,null,null,null,null,null,null,null,null,null,{"$f":"IF(#REF!=\"\",\"\",IF(#REF!<TODAY(),0,IF(#REF!<(TODAY()+365),1,\"X\")))","v":{"$error":"#REF!"}},{"$f":"IF(#REF!=\"\",\"\",\"X\")","v":{"$error":"#REF!"}}]
[null,null,null,null,null,null,null,null,null,null,null,null,null,null,null,{"$f":"IF(#REF!=\"\",\"\",IF(#REF!<TODAY(),0,IF(#REF!<(TODAY()+365),1,\"X\")))","v":{"$error":"#REF!"}},{"$f":"IF(#REF!=\"\",\"\",\"X\")","v":{"$error":"#REF!"}}]
[null,null,null,null,null,null,null,null,null,null,null,null,null,null,null,{"$f":"IF(#REF!=\"\",\"\",IF(#REF!<TODAY(),0,IF(#REF!<(TODAY()+365),1,\"X\")))","v":{"$error":"#REF!"}},{"$f":"IF(#REF!=\"\",\"\",\"X\")","v":{"$error":"#REF!"}}]
[null,null,null,null,null,null,null,null,null,null,null,null,null,null,null,{"$f":"IF(#REF!=\"\",\"\",IF(#REF!<TODAY(),0,IF(#REF!<(TODAY()+365),1,\"X\")))","v":{"$error":"#REF!"}},{"$f":"IF(#REF!=\"\",\"\",\"X\")","v":{"$error":"#REF!"}}]
[null,null,null,null,null,null,null,null,null,null,null,null,null,null,null,{"$f":"IF(#REF!=\"\",\"\",IF(#REF!<TODAY(),0,IF(#REF!<(TODAY()+365),1,\"X\")))","v":{"$error":"#REF!"}},{"$f":"IF(#REF!=\"\",\"\",\"X\")","v":{"$error":"#REF!"}}]
[null,null,null,null,null,null,null,null,null,null,null,null,null,null,null,{"$f":"IF(#REF!=\"\",\"\",IF(#REF!<TODAY(),0,IF(#REF!<(TODAY()+365),1,\"X\")))","v":{"$error":"#REF!"}},{"$f":"IF(#REF!=\"\",\"\",\"X\")","v":{"$error":"#REF!"}}]
[null,null,null,null,null,null,null,null,null,null,null,null,null,null,null,{"$f":"IF(#REF!=\"\",\"\",IF(#REF!<TODAY(),0,IF(#REF!<(TODAY()+365),1,\"X\")))","v":{"$error":"#REF!"}},{"$f":"IF(#REF!=\"\",\"\",\"X\")","v":{"$error":"#REF!"}}]
[null,null,null,null,null,null,null,null,null,null,null,null,null,null,null,{"$f":"IF(#REF!=\"\",\"\",IF(#REF!<TODAY(),0,IF(#REF!<(TODAY()+365),1,\"X\")))","v":{"$error":"#REF!"}},{"$f":"IF(#REF!=\"\",\"\",\"X\")","v":{"$error":"#REF!"}}]
[null,null,null,null,null,null,null,null,null,null,null,null,null,null,null,{"$f":"IF(#REF!=\"\",\"\",IF(#REF!<TODAY(),0,IF(#REF!<(TODAY()+365),1,\"X\")))","v":{"$error":"#REF!"}},{"$f":"IF(#REF!=\"\",\"\",\"X\")","v":{"$error":"#REF!"}}]
[null,null,null,null,null,null,null,null,null,null,null,null,null,null,null,{"$f":"IF(#REF!=\"\",\"\",IF(#REF!<TODAY(),0,IF(#REF!<(TODAY()+365),1,\"X\")))","v":{"$error":"#REF!"}},{"$f":"IF(#REF!=\"\",\"\",\"X\")","v":{"$error":"#REF!"}}]
[null,null,null,null,null,null,null,null,null,null,null,null,null,null,null,{"$f":"IF(#REF!=\"\",\"\",IF(#REF!<TODAY(),0,IF(#REF!<(TODAY()+365),1,\"X\")))","v":{"$error":"#REF!"}},{"$f":"IF(#REF!=\"\",\"\",\"X\")","v":{"$error":"#REF!"}}]
[null,null,null,null,null,null,null,null,null,null,null,null,null,null,null,{"$f":"IF(#REF!=\"\",\"\",IF(#REF!<TODAY(),0,IF(#REF!<(TODAY()+365),1,\"X\")))","v":{"$error":"#REF!"}},{"$f":"IF(#REF!=\"\",\"\",\"X\")","v":{"$error":"#REF!"}}]
[null,null,null,null,null,null,null,null,null,null,null,null,null,null,null,{"$f":"IF(#REF!=\"\",\"\",IF(#REF!<TODAY(),0,IF(#REF!<(TODAY()+365),1,\"X\")))","v":{"$error":"#REF!"}},{"$f":"IF(#REF!=\"\",\"\",\"X\")","v":{"$error":"#REF!"}}]
[null,null,null,null,null,null,null,null,null,null,null,null,null,null,null,{"$f":"IF(#REF!=\"\",\"\",IF(#REF!<TODAY(),0,IF(#REF!<(TODAY()+365),1,\"X\")))","v":{"$error":"#REF!"}},{"$f":"IF(#REF!=\"\",\"\",\"X\")","v":{"$error":"#REF!"}}]
[null,null,null,null,null,null,null,null,null,null,null,null,null,null,null,{"$f":"IF(#REF!=\"\",\"\",IF(#REF!<TODAY(),0,IF(#REF!<(TODAY()+365),1,\"X\")))","v":{"$error":"#REF!"}},{"$f":"IF(#REF!=\"\",\"\",\"X\")","v":{"$error":"#REF!"}}]
[null,null,null,null,null,null,null,null,null,null,null,null,null,null,null,{"$f":"IF(#REF!=\"\",\"\",IF(#REF!<TODAY(),0,IF(#REF!<(TODAY()+365),1,\"X\")))","v":{"$error":"#REF!"}},{"$f":"IF(#REF!=\"\",\"\",\"X\")","v":{"$error":"#REF!"}}]
[null,null,null,null,null,null,null,null,null,null,null,null,null,null,null,{"$f":"IF(#REF!=\"\",\"\",IF(#REF!<TODAY(),0,IF(#REF!<(TODAY()+365),1,\"X\")))","v":{"$error":"#REF!"}},{"$f":"IF(#REF!=\"\",\"\",\"X\")","v":{"$error":"#REF!"}}]
[null,null,null,null,null,null,null,null,null,null,null,null,null,null,null,{"$f":"IF(#REF!=\"\",\"\",IF(#REF!<TODAY(),0,IF(#REF!<(TODAY()+365),1,\"X\")))","v":{"$error":"#REF!"}},{"$f":"IF(#REF!=\"\",\"\",\"X\")","v":{"$error":"#REF!"}}]
[null,null,null,null,null,null,null,null,null,null,null,null,null,null,null,{"$f":"IF(#REF!=\"\",\"\",IF(#REF!<TODAY(),0,IF(#REF!<(TODAY()+365),1,\"X\")))","v":{"$error":"#REF!"}},{"$f":"IF(#REF!=\"\",\"\",\"X\")","v":{"$error":"#REF!"}}]
[null,null,null,null,null,null,null,null,null,null,null,null,null,null,null,{"$f":"IF(#REF!=\"\",\"\",IF(#REF!<TODAY(),0,IF(#REF!<(TODAY()+365),1,\"X\")))","v":{"$error":"#REF!"}},{"$f":"IF(#REF!=\"\",\"\",\"X\")","v":{"$error":"#REF!"}}]
[null,null,null,null,null,null,null,null,null,null,null,null,null,null,null,{"$f":"IF(#REF!=\"\",\"\",IF(#REF!<TODAY(),0,IF(#REF!<(TODAY()+365),1,\"X\")))","v":{"$error":"#REF!"}},{"$f":"IF(#REF!=\"\",\"\",\"X\")","v":{"$error":"#REF!"}}]
[null,null,null,null,null,null,null,null,null,null,null,null,null,null,null,{"$f":"IF(#REF!=\"\",\"\",IF(#REF!<TODAY(),0,IF(#REF!<(TODAY()+365),1,\"X\")))","v":{"$error":"#REF!"}},{"$f":"IF(#REF!=\"\",\"\",\"X\")","v":{"$error":"#REF!"}}]
[null,null,null,null,null,null,null,null,null,null,null,null,null,null,null,{"$f":"IF(#REF!=\"\",\"\",IF(#REF!<TODAY(),0,IF(#REF!<(TODAY()+365),1,\"X\")))","v":{"$error":"#REF!"}},{"$f":"IF(#REF!=\"\",\"\",\"X\")","v":{"$error":"#REF!"}}]
[null,null,null,null,null,null,null,null,null,null,null,null,null,null,null,{"$f":"IF(#REF!=\"\",\"\",IF(#REF!<TODAY(),0,IF(#REF!<(TODAY()+365),1,\"X\")))","v":{"$error":"#REF!"}},{"$f":"IF(#REF!=\"\",\"\",\"X\")","v":{"$error":"#REF!"}}]
[null,null,null,null,null,null,null,null,null,null,null,null,null,null,null,{"$f":"IF(#REF!=\"\",\"\",IF(#REF!<TODAY(),0,IF(#REF!<(TODAY()+365),1,\"X\")))","v":{"$error":"#REF!"}},{"$f":"IF(#REF!=\"\",\"\",\"X\")","v":{"$error":"#REF!"}}]
[null,null,null,null,null,null,null,null,null,null,null,null,null,null,null,{"$f":"IF(#REF!=\"\",\"\",IF(#REF!<TODAY(),0,IF(#REF!<(TODAY()+365),1,\"X\")))","v":{"$error":"#REF!"}},{"$f":"IF(#REF!=\"\",\"\",\"X\")","v":{"$error":"#REF!"}}]
[null,null,null,null,null,null,null,null,null,null,null,null,null,null,null,{"$f":"IF(#REF!=\"\",\"\",IF(#REF!<TODAY(),0,IF(#REF!<(TODAY()+365),1,\"X\")))","v":{"$error":"#REF!"}},{"$f":"IF(#REF!=\"\",\"\",\"X\")","v":{"$error":"#REF!"}}]
[null,null,null,null,null,null,null,null,null,null,null,null,null,null,null,{"$f":"IF(#REF!=\"\",\"\",IF(#REF!<TODAY(),0,IF(#REF!<(TODAY()+365),1,\"X\")))","v":{"$error":"#REF!"}},{"$f":"IF(#REF!=\"\",\"\",\"X\")","v":{"$error":"#REF!"}}]
[null,null,null,null,null,null,null,null,null,null,null,null,null,null,null,{"$f":"IF(#REF!=\"\",\"\",IF(#REF!<TODAY(),0,IF(#REF!<(TODAY()+365),1,\"X\")))","v":{"$error":"#REF!"}},{"$f":"IF(#REF!=\"\",\"\",\"X\")","v":{"$error":"#REF!"}}]
[null,null,null,null,null,null,null,null,null,null,null,null,null,null,null,{"$f":"IF(#REF!=\"\",\"\",IF(#REF!<TODAY(),0,IF(#REF!<(TODAY()+365),1,\"X\")))","v":{"$error":"#REF!"}},{"$f":"IF(#REF!=\"\",\"\",\"X\")","v":{"$error":"#REF!"}}]
[null,null,null,null,null,null,null,null,null,null,null,null,null,null,null,{"$f":"IF(#REF!=\"\",\"\",IF(#REF!<TODAY(),0,IF(#REF!<(TODAY()+365),1,\"X\")))","v":{"$error":"#REF!"}},{"$f":"IF(#REF!=\"\",\"\",\"X\")","v":{"$error":"#REF!"}}]
[null,null,null,null,null,null,null,null,null,null,null,null,null,null,null,{"$f":"IF(#REF!=\"\",\"\",IF(#REF!<TODAY(),0,IF(#REF!<(TODAY()+365),1,\"X\")))","v":{"$error":"#REF!"}},{"$f":"IF(#REF!=\"\",\"\",\"X\")","v":{"$error":"#REF!"}}]
[null,null,null,null,null,null,null,null,null,null,null,null,null,null,null,{"$f":"IF(#REF!=\"\",\"\",IF(#REF!<TODAY(),0,IF(#REF!<(TODAY()+365),1,\"X\")))","v":{"$error":"#REF!"}},{"$f":"IF(#REF!=\"\",\"\",\"X\")","v":{"$error":"#REF!"}}]
[null,null,null,null,null,null,null,null,null,null,null,null,null,null,null,{"$f":"IF(#REF!=\"\",\"\",IF(#REF!<TODAY(),0,IF(#REF!<(TODAY()+365),1,\"X\")))","v":{"$error":"#REF!"}},{"$f":"IF(#REF!=\"\",\"\",\"X\")","v":{"$error":"#REF!"}}]
[null,null,null,null,null,null,null,null,null,null,null,null,null,null,null,{"$f":"IF(#REF!=\"\",\"\",IF(#REF!<TODAY(),0,IF(#REF!<(TODAY()+365),1,\"X\")))","v":{"$error":"#REF!"}},{"$f":"IF(#REF!=\"\",\"\",\"X\")","v":{"$error":"#REF!"}}]
[null,null,null,null,null,null,null,null,null,null,null,null,null,null,null,{"$f":"IF(#REF!=\"\",\"\",IF(#REF!<TODAY(),0,IF(#REF!<(TODAY()+365),1,\"X\")))","v":{"$error":"#REF!"}},{"$f":"IF(#REF!=\"\",\"\",\"X\")","v":{"$error":"#REF!"}}]
[null,null,null,null,null,null,null,null,null,null,null,null,null,null,null,{"$f":"IF(#REF!=\"\",\"\",IF(#REF!<TODAY(),0,IF(#REF!<(TODAY()+365),1,\"X\")))","v":{"$error":"#REF!"}},{"$f":"IF(#REF!=\"\",\"\",\"X\")","v":{"$error":"#REF!"}}]
[null,null,null,null,null,null,null,null,null,null,null,null,null,null,null,{"$f":"IF(#REF!=\"\",\"\",IF(#REF!<TODAY(),0,IF(#REF!<(TODAY()+365),1,\"X\")))","v":{"$error":"#REF!"}},{"$f":"IF(#REF!=\"\",\"\",\"X\")","v":{"$error":"#REF!"}}]
[null,null,null,null,null,null,null,null,null,null,null,null,null,null,null,{"$f":"IF(#REF!=\"\",\"\",IF(#REF!<TODAY(),0,IF(#REF!<(TODAY()+365),1,\"X\")))","v":{"$error":"#REF!"}},{"$f":"IF(#REF!=\"\",\"\",\"X\")","v":{"$error":"#REF!"}}]
[null,null,null,null,null,null,null,null,null,null,null,null,null,null,null,{"$f":"IF(#REF!=\"\",\"\",IF(#REF!<TODAY(),0,IF(#REF!<(TODAY()+365),1,\"X\")))","v":{"$error":"#REF!"}},{"$f":"IF(#REF!=\"\",\"\",\"X\")","v":{"$error":"#REF!"}}]
[null,null,null,null,null,null,null,null,null,null,null,null,null,null,null,{"$f":"IF(#REF!=\"\",\"\",IF(#REF!<TODAY(),0,IF(#REF!<(TODAY()+365),1,\"X\")))","v":{"$error":"#REF!"}},{"$f":"IF(#REF!=\"\",\"\",\"X\")","v":{"$error":"#REF!"}}]
[null,null,null,null,null,null,null,null,null,null,null,null,null,null,null,{"$f":"IF(#REF!=\"\",\"\",IF(#REF!<TODAY(),0,IF(#REF!<(TODAY()+365),1,\"X\")))","v":{"$error":"#REF!"}},{"$f":"IF(#REF!=\"\",\"\",\"X\")","v":{"$error":"#REF!"}}]
[null,null,null,null,null,null,null,null,null,null,null,null,null,null,null,{"$f":"IF(#REF!=\"\",\"\",IF(#REF!<TODAY(),0,IF(#REF!<(TODAY()+365),1,\"X\")))","v":{"$error":"#REF!"}},{"$f":"IF(#REF!=\"\",\"\",\"X\")","v":{"$error":"#REF!"}}]
[null,null,null,null,null,null,null,null,null,null,null,null,null,null,null,{"$f":"IF(#REF!=\"\",\"\",IF(#REF!<TODAY(),0,IF(#REF!<(TODAY()+365),1,\"X\")))","v":{"$error":"#REF!"}},{"$f":"IF(#REF!=\"\",\"\",\"X\")","v":{"$error":"#REF!"}}]
[null,null,null,null,null,null,null,null,null,null,null,null,null,null,null,{"$f":"IF(#REF!=\"\",\"\",IF(#REF!<TODAY(),0,IF(#REF!<(TODAY()+365),1,\"X\")))","v":{"$error":"#REF!"}},{"$f":"IF(#REF!=\"\",\"\",\"X\")","v":{"$error":"#REF!"}}]
[null,null,null,null,null,null,null,null,null,null,null,null,null,null,null,{"$f":"IF(#REF!=\"\",\"\",IF(#REF!<TODAY(),0,IF(#REF!<(TODAY()+365),1,\"X\")))","v":{"$error":"#REF!"}},{"$f":"IF(#REF!=\"\",\"\",\"X\")","v":{"$error":"#REF!"}}]
[null,null,null,null,null,null,null,null,null,null,null,null,null,null,null,{"$f":"IF(#REF!=\"\",\"\",IF(#REF!<TODAY(),0,IF(#REF!<(TODAY()+365),1,\"X\")))","v":{"$error":"#REF!"}},{"$f":"IF(#REF!=\"\",\"\",\"X\")","v":{"$error":"#REF!"}}]
[null,null,null,null,null,null,null,null,null,null,null,null,null,null,null,{"$f":"IF(#REF!=\"\",\"\",IF(#REF!<TODAY(),0,IF(#REF!<(TODAY()+365),1,\"X\")))","v":{"$error":"#REF!"}},{"$f":"IF(#REF!=\"\",\"\",\"X\")","v":{"$error":"#REF!"}}]
[null,null,null,null,null,null,null,null,null,null,null,null,null,null,null,{"$f":"IF(#REF!=\"\",\"\",IF(#REF!<TODAY(),0,IF(#REF!<(TODAY()+365),1,\"X\")))","v":{"$error":"#REF!"}},{"$f":"IF(#REF!=\"\",\"\",\"X\")","v":{"$error":"#REF!"}}]
[null,null,null,null,null,null,null,null,null,null,null,null,null,null,null,{"$f":"IF(#REF!=\"\",\"\",IF(#REF!<TODAY(),0,IF(#REF!<(TODAY()+365),1,\"X\")))","v":{"$error":"#REF!"}},{"$f":"IF(#REF!=\"\",\"\",\"X\")","v":{"$error":"#REF!"}}]
[null,null,null,null,null,null,null,null,null,null,null,null,null,null,null,{"$f":"IF(#REF!=\"\",\"\",IF(#REF!<TODAY(),0,IF(#REF!<(TODAY()+365),1,\"X\")))","v":{"$error":"#REF!"}},{"$f":"IF(#REF!=\"\",\"\",\"X\")","v":{"$error":"#REF!"}}]
[null,null,null,null,null,null,null,null,null,null,null,null,null,null,null,{"$f":"IF(#REF!=\"\",\"\",IF(#REF!<TODAY(),0,IF(#REF!<(TODAY()+365),1,\"X\")))","v":{"$error":"#REF!"}},{"$f":"IF(#REF!=\"\",\"\",\"X\")","v":{"$error":"#REF!"}}]
[null,null,null,null,null,null,null,null,null,null,null,null,null,null,null,{"$f":"IF(#REF!=\"\",\"\",IF(#REF!<TODAY(),0,IF(#REF!<(TODAY()+365),1,\"X\")))","v":{"$error":"#REF!"}},{"$f":"IF(#REF!=\"\",\"\",\"X\")","v":{"$error":"#REF!"}}]
[null,null,null,null,null,null,null,null,null,null,null,null,null,null,null,{"$f":"IF(#REF!=\"\",\"\",IF(#REF!<TODAY(),0,IF(#REF!<(TODAY()+365),1,\"X\")))","v":{"$error":"#REF!"}},{"$f":"IF(#REF!=\"\",\"\",\"X\")","v":{"$error":"#REF!"}}]
[null,null,null,null,null,null,null,null,null,null,null,null,null,null,null,{"$f":"IF(#REF!=\"\",\"\",IF(#REF!<TODAY(),0,IF(#REF!<(TODAY()+365),1,\"X\")))","v":{"$error":"#REF!"}},{"$f":"IF(#REF!=\"\",\"\",\"X\")","v":{"$error":"#REF!"}}]
[null,null,null,null,null,null,null,null,null,null,null,null,null,null,null,{"$f":"IF(#REF!=\"\",\"\",IF(#REF!<TODAY(),0,IF(#REF!<(TODAY()+365),1,\"X\")))","v":{"$error":"#REF!"}},{"$f":"IF(#REF!=\"\",\"\",\"X\")","v":{"$error":"#REF!"}}]
[null,null,null,null,null,null,null,null,null,null,null,null,null,null,null,{"$f":"IF(#REF!=\"\",\"\",IF(#REF!<TODAY(),0,IF(#REF!<(TODAY()+365),1,\"X\")))","v":{"$error":"#REF!"}},{"$f":"IF(#REF!=\"\",\"\",\"X\")","v":{"$error":"#REF!"}}]
[null,null,null,null,null,null,null,null,null,null,null,null,null,null,null,{"$f":"IF(#REF!=\"\",\"\",IF(#REF!<TODAY(),0,IF(#REF!<(TODAY()+365),1,\"X\")))","v":{"$error":"#REF!"}},{"$f":"IF(#REF!=\"\",\"\",\"X\")","v":{"$error":"#REF!"}}]
[null,null,null,null,null,null,null,null,null,null,null,null,null,null,null,{"$f":"IF(#REF!=\"\",\"\",IF(#REF!<TODAY(),0,IF(#REF!<(TODAY()+365),1,\"X\")))","v":{"$error":"#REF!"}},{"$f":"IF(#REF!=\"\",\"\",\"X\")","v":{"$error":"#REF!"}}]
[null,null,null,null,null,null,null,null,null,null,null,null,null,null,null,{"$f":"IF(#REF!=\"\",\"\",IF(#REF!<TODAY(),0,IF(#REF!<(TODAY()+365),1,\"X\")))","v":{"$error":"#REF!"}},{"$f":"IF(#REF!=\"\",\"\",\"X\")","v":{"$error":"#REF!"}}]
[null,null,null,null,null,null,null,null,null,null,null,null,null,null,null,{"$f":"IF(#REF!=\"\",\"\",IF(#REF!<TODAY(),0,IF(#REF!<(TODAY()+365),1,\"X\")))","v":{"$error":"#REF!"}},{"$f":"IF(#REF!=\"\",\"\",\"X\")","v":{"$error":"#REF!"}}]
[null,null,null,null,null,null,null,null,null,null,null,null,null,null,null,{"$f":"IF(#REF!=\"\",\"\",IF(#REF!<TODAY(),0,IF(#REF!<(TODAY()+365),1,\"X\")))","v":{"$error":"#REF!"}},{"$f":"IF(#REF!=\"\",\"\",\"X\")","v":{"$error":"#REF!"}}]
[null,null,null,null,null,null,null,null,null,null,null,null,null,null,null,{"$f":"IF(#REF!=\"\",\"\",IF(#REF!<TODAY(),0,IF(#REF!<(TODAY()+365),1,\"X\")))","v":{"$error":"#REF!"}},{"$f":"IF(#REF!=\"\",\"\",\"X\")","v":{"$error":"#REF!"}}]
[null,null,null,null,null,null,null,null,null,null,null,null,null,null,null,{"$f":"IF(#REF!=\"\",\"\",IF(#REF!<TODAY(),0,IF(#REF!<(TODAY()+365),1,\"X\")))","v":{"$error":"#REF!"}},{"$f":"IF(#REF!=\"\",\"\",\"X\")","v":{"$error":"#REF!"}}]
[null,null,null,null,null,null,null,null,null,null,null,null,null,null,null,{"$f":"IF(#REF!=\"\",\"\",IF(#REF!<TODAY(),0,IF(#REF!<(TODAY()+365),1,\"X\")))","v":{"$error":"#REF!"}},{"$f":"IF(#REF!=\"\",\"\",\"X\")","v":{"$error":"#REF!"}}]
[null,null,null,null,null,null,null,null,null,null,null,null,null,null,null,{"$f":"IF(#REF!=\"\",\"\",IF(#REF!<TODAY(),0,IF(#REF!<(TODAY()+365),1,\"X\")))","v":{"$error":"#REF!"}},{"$f":"IF(#REF!=\"\",\"\",\"X\")","v":{"$error":"#REF!"}}]
[null,null,null,null,null,null,null,null,null,null,null,null,null,null,null,{"$f":"IF(#REF!=\"\",\"\",IF(#REF!<TODAY(),0,IF(#REF!<(TODAY()+365),1,\"X\")))","v":{"$error":"#REF!"}},{"$f":"IF(#REF!=\"\",\"\",\"X\")","v":{"$error":"#REF!"}}]
[null,null,null,null,null,null,null,null,null,null,null,null,null,null,null,{"$f":"IF(#REF!=\"\",\"\",IF(#REF!<TODAY(),0,IF(#REF!<(TODAY()+365),1,\"X\")))","v":{"$error":"#REF!"}},{"$f":"IF(#REF!=\"\",\"\",\"X\")","v":{"$error":"#REF!"}}]
[null,null,null,null,null,null,null,null,null,null,null,null,null,null,null,{"$f":"IF(#REF!=\"\",\"\",IF(#REF!<TODAY(),0,IF(#REF!<(TODAY()+365),1,\"X\")))","v":{"$error":"#REF!"}},{"$f":"IF(#REF!=\"\",\"\",\"X\")","v":{"$error":"#REF!"}}]
[null,null,null,null,null,null,null,null,null,null,null,null,null,null,null,{"$f":"IF(#REF!=\"\",\"\",IF(#REF!<TODAY(),0,IF(#REF!<(TODAY()+365),1,\"X\")))","v":{"$error":"#REF!"}},{"$f":"IF(#REF!=\"\",\"\",\"X\")","v":{"$error":"#REF!"}}]
[null,null,null,null,null,null,null,null,null,null,null,null,null,null,null,{"$f":"IF(#REF!=\"\",\"\",IF(#REF!<TODAY(),0,IF(#REF!<(TODAY()+365),1,\"X\")))","v":{"$error":"#REF!"}},{"$f":"IF(#REF!=\"\",\"\",\"X\")","v":{"$error":"#REF!"}}]
[null,null,null,null,null,null,null,null,null,null,null,null,null,null,null,{"$f":"IF(#REF!=\"\",\"\",IF(#REF!<TODAY(),0,IF(#REF!<(TODAY()+365),1,\"X\")))","v":{"$error":"#REF!"}},{"$f":"IF(#REF!=\"\",\"\",\"X\")","v":{"$error":"#REF!"}}]
[null,null,null,null,null,null,null,null,null,null,null,null,null,null,null,{"$f":"IF(#REF!=\"\",\"\",IF(#REF!<TODAY(),0,IF(#REF!<(TODAY()+365),1,\"X\")))","v":{"$error":"#REF!"}},{"$f":"IF(#REF!=\"\",\"\",\"X\")","v":{"$error":"#REF!"}}]
[null,null,null,null,null,null,null,null,null,null,null,null,null,null,null,{"$f":"IF(#REF!=\"\",\"\",IF(#REF!<TODAY(),0,IF(#REF!<(TODAY()+365),1,\"X\")))","v":{"$error":"#REF!"}},{"$f":"IF(#REF!=\"\",\"\",\"X\")","v":{"$error":"#REF!"}}]
[null,null,null,null,null,null,null,null,null,null,null,null,null,null,null,{"$f":"IF(#REF!=\"\",\"\",IF(#REF!<TODAY(),0,IF(#REF!<(TODAY()+365),1,\"X\")))","v":{"$error":"#REF!"}},{"$f":"IF(#REF!=\"\",\"\",\"X\")","v":{"$error":"#REF!"}}]
[null,null,null,null,null,null,null,null,null,null,null,null,null,null,null,{"$f":"IF(#REF!=\"\",\"\",IF(#REF!<TODAY(),0,IF(#REF!<(TODAY()+365),1,\"X\")))","v":{"$error":"#REF!"}},{"$f":"IF(#REF!=\"\",\"\",\"X\")","v":{"$error":"#REF!"}}]
[null,null,null,null,null,null,null,null,null,null,null,null,null,null,null,{"$f":"IF(#REF!=\"\",\"\",IF(#REF!<TODAY(),0,IF(#REF!<(TODAY()+365),1,\"X\")))","v":{"$error":"#REF!"}},{"$f":"IF(#REF!=\"\",\"\",\"X\")","v":{"$error":"#REF!"}}]
[null,null,null,null,null,null,null,null,null,null,null,null,null,null,null,{"$f":"IF(#REF!=\"\",\"\",IF(#REF!<TODAY(),0,IF(#REF!<(TODAY()+365),1,\"X\")))","v":{"$error":"#REF!"}},{"$f":"IF(#REF!=\"\",\"\",\"X\")","v":{"$error":"#REF!"}}]
[null,null,null,null,null,null,null,null,null,null,null,null,null,null,null,{"$f":"IF(#REF!=\"\",\"\",IF(#REF!<TODAY(),0,IF(#REF!<(TODAY()+365),1,\"X\")))","v":{"$error":"#REF!"}},{"$f":"IF(#REF!=\"\",\"\",\"X\")","v":{"$error":"#REF!"}}]
[null,null,null,null,null,null,null,null,null,null,null,null,null,null,null,{"$f":"IF(#REF!=\"\",\"\",IF(#REF!<TODAY(),0,IF(#REF!<(TODAY()+365),1,\"X\")))","v":{"$error":"#REF!"}},{"$f":"IF(#REF!=\"\",\"\",\"X\")","v":{"$error":"#REF!"}}]
[null,null,null,null,null,null,null,null,null,null,null,null,null,null,null,{"$f":"IF(#REF!=\"\",\"\",IF(#REF!<TODAY(),0,IF(#REF!<(TODAY()+365),1,\"X\")))","v":{"$error":"#REF!"}},{"$f":"IF(#REF!=\"\",\"\",\"X\")","v":{"$error":"#REF!"}}]
[null,null,null,null,null,null,null,null,null,null,null,null,null,null,null,{"$f":"IF(#REF!=\"\",\"\",IF(#REF!<TODAY(),0,IF(#REF!<(TODAY()+365),1,\"X\")))","v":{"$error":"#REF!"}},{"$f":"IF(#REF!=\"\",\"\",\"X\")","v":{"$error":"#REF!"}}]
[null,null,null,null,null,null,null,null,null,null,null,null,null,null,null,{"$f":"IF(#REF!=\"\",\"\",IF(#REF!<TODAY(),0,IF(#REF!<(TODAY()+365),1,\"X\")))","v":{"$error":"#REF!"}},{"$f":"IF(#REF!=\"\",\"\",\"X\")","v":{"$error":"#REF!"}}]
[null,null,null,null,null,null,null,null,null,null,null,null,null,null,null,{"$f":"IF(#REF!=\"\",\"\",IF(#REF!<TODAY(),0,IF(#REF!<(TODAY()+365),1,\"X\")))","v":{"$error":"#REF!"}},{"$f":"IF(#REF!=\"\",\"\",\"X\")","v":{"$error":"#REF!"}}]
[null,null,null,null,null,null,null,null,null,null,null,null,null,null,null,{"$f":"IF(#REF!=\"\",\"\",IF(#REF!<TODAY(),0,IF(#REF!<(TODAY()+365),1,\"X\")))","v":{"$error":"#REF!"}},{"$f":"IF(#REF!=\"\",\"\",\"X\")","v":{"$error":"#REF!"}}]
[null,null,null,null,null,null,null,null,null,null,null,null,null,null,null,{"$f":"IF(#REF!=\"\",\"\",IF(#REF!<TODAY(),0,IF(#REF!<(TODAY()+365),1,\"X\")))","v":{"$error":"#REF!"}},{"$f":"IF(#REF!=\"\",\"\",\"X\")","v":{"$error":"#REF!"}}]
[null,null,null,null,null,null,null,null,null,null,null,null,null,null,null,{"$f":"IF(#REF!=\"\",\"\",IF(#REF!<TODAY(),0,IF(#REF!<(TODAY()+365),1,\"X\")))","v":{"$error":"#REF!"}},{"$f":"IF(#REF!=\"\",\"\",\"X\")","v":{"$error":"#REF!"}}]
[null,null,null,null,null,null,null,null,null,null,null,null,null,null,null,{"$f":"IF(#REF!=\"\",\"\",IF(#REF!<TODAY(),0,IF(#REF!<(TODAY()+365),1,\"X\")))","v":{"$error":"#REF!"}},{"$f":"IF(#REF!=\"\",\"\",\"X\")","v":{"$error":"#REF!"}}]
[null,null,null,null,null,null,null,null,null,null,null,null,null,null,null,{"$f":"IF(#REF!=\"\",\"\",IF(#REF!<TODAY(),0,IF(#REF!<(TODAY()+365),1,\"X\")))","v":{"$error":"#REF!"}},{"$f":"IF(#REF!=\"\",\"\",\"X\")","v":{"$error":"#REF!"}}]
[null,null,null,null,null,null,null,null,null,null,null,null,null,null,null,{"$f":"IF(#REF!=\"\",\"\",IF(#REF!<TODAY(),0,IF(#REF!<(TODAY()+365),1,\"X\")))","v":{"$error":"#REF!"}},{"$f":"IF(#REF!=\"\",\"\",\"X\")","v":{"$error":"#REF!"}}]
[null,null,null,null,null,null,null,null,null,null,null,null,null,null,null,{"$f":"IF(#REF!=\"\",\"\",IF(#REF!<TODAY(),0,IF(#REF!<(TODAY()+365),1,\"X\")))","v":{"$error":"#REF!"}},{"$f":"IF(#REF!=\"\",\"\",\"X\")","v":{"$error":"#REF!"}}]
[null,null,null,null,null,null,null,null,null,null,null,null,null,null,null,{"$f":"IF(#REF!=\"\",\"\",IF(#REF!<TODAY(),0,IF(#REF!<(TODAY()+365),1,\"X\")))","v":{"$error":"#REF!"}},{"$f":"IF(#REF!=\"\",\"\",\"X\")","v":{"$error":"#REF!"}}]
[null,null,null,null,null,null,null,null,null,null,null,null,null,null,null,{"$f":"IF(#REF!=\"\",\"\",IF(#REF!<TODAY(),0,IF(#REF!<(TODAY()+365),1,\"X\")))","v":{"$error":"#REF!"}},{"$f":"IF(#REF!=\"\",\"\",\"X\")","v":{"$error":"#REF!"}}]
[null,null,null,null,null,null,null,null,null,null,null,null,null,null,null,{"$f":"IF(#REF!=\"\",\"\",IF(#REF!<TODAY(),0,IF(#REF!<(TODAY()+365),1,\"X\")))","v":{"$error":"#REF!"}},{"$f":"IF(#REF!=\"\",\"\",\"X\")","v":{"$error":"#REF!"}}]
[null,null,null,null,null,null,null,null,null,null,null,null,null,null,null,{"$f":"IF(#REF!=\"\",\"\",IF(#REF!<TODAY(),0,IF(#REF!<(TODAY()+365),1,\"X\")))","v":{"$error":"#REF!"}},{"$f":"IF(#REF!=\"\",\"\",\"X\")","v":{"$error":"#REF!"}}]
[null,null,null,null,null,null,null,null,null,null,null,null,null,null,null,{"$f":"IF(#REF!=\"\",\"\",IF(#REF!<TODAY(),0,IF(#REF!<(TODAY()+365),1,\"X\")))","v":{"$error":"#REF!"}},{"$f":"IF(#REF!=\"\",\"\",\"X\")","v":{"$error":"#REF!"}}]
[null,null,null,null,null,null,null,null,null,null,null,null,null,null,null,{"$f":"IF(#REF!=\"\",\"\",IF(#REF!<TODAY(),0,IF(#REF!<(TODAY()+365),1,\"X\")))","v":{"$error":"#REF!"}},{"$f":"IF(#REF!=\"\",\"\",\"X\")","v":{"$error":"#REF!"}}]
[null,null,null,null,null,null,null,null,null,null,null,null,null,null,null,{"$f":"IF(#REF!=\"\",\"\",IF(#REF!<TODAY(),0,IF(#REF!<(TODAY()+365),1,\"X\")))","v":{"$error":"#REF!"}},{"$f":"IF(#REF!=\"\",\"\",\"X\")","v":{"$error":"#REF!"}}]
[null,null,null,null,null,null,null,null,null,null,null,null,null,null,null,{"$f":"IF(#REF!=\"\",\"\",IF(#REF!<TODAY(),0,IF(#REF!<(TODAY()+365),1,\"X\")))","v":{"$error":"#REF!"}},{"$f":"IF(#REF!=\"\",\"\",\"X\")","v":{"$error":"#REF!"}}]
[null,null,null,null,null,null,null,null,null,null,null,null,null,null,null,{"$f":"IF(#REF!=\"\",\"\",IF(#REF!<TODAY(),0,IF(#REF!<(TODAY()+365),1,\"X\")))","v":{"$error":"#REF!"}},{"$f":"IF(#REF!=\"\",\"\",\"X\")","v":{"$error":"#REF!"}}]
[null,null,null,null,null,null,null,null,null,null,null,null,null,null,null,{"$f":"IF(#REF!=\"\",\"\",IF(#REF!<TODAY(),0,IF(#REF!<(TODAY()+365),1,\"X\")))","v":{"$error":"#REF!"}},{"$f":"IF(#REF!=\"\",\"\",\"X\")","v":{"$error":"#REF!"}}]
[null,null,null,null,null,null,null,null,null,null,null,null,null,null,null,{"$f":"IF(#REF!=\"\",\"\",IF(#REF!<TODAY(),0,IF(#REF!<(TODAY()+365),1,\"X\")))","v":{"$error":"#REF!"}},{"$f":"IF(#REF!=\"\",\"\",\"X\")","v":{"$error":"#REF!"}}]
[null,null,null,null,null,null,null,null,null,null,null,null,null,null,null,{"$f":"IF(#REF!=\"\",\"\",IF(#REF!<TODAY(),0,IF(#REF!<(TODAY()+365),1,\"X\")))","v":{"$error":"#REF!"}},{"$f":"IF(#REF!=\"\",\"\",\"X\")","v":{"$error":"#REF!"}}]
[null,null,null,null,null,null,null,null,null,null,null,null,null,null,null,{"$f":"IF(#REF!=\"\",\"\",IF(#REF!<TODAY(),0,IF(#REF!<(TODAY()+365),1,\"X\")))","v":{"$error":"#REF!"}},{"$f":"IF(#REF!=\"\",\"\",\"X\")","v":{"$error":"#REF!"}}]
[null,null,null,null,null,null,null,null,null,null,null,null,null,null,null,{"$f":"IF(#REF!=\"\",\"\",IF(#REF!<TODAY(),0,IF(#REF!<(TODAY()+365),1,\"X\")))","v":{"$error":"#REF!"}},{"$f":"IF(#REF!=\"\",\"\",\"X\")","v":{"$error":"#REF!"}}]
[null,null,null,null,null,null,null,null,null,null,null,null,null,null,null,{"$f":"IF(#REF!=\"\",\"\",IF(#REF!<TODAY(),0,IF(#REF!<(TODAY()+365),1,\"X\")))","v":{"$error":"#REF!"}},{"$f":"IF(#REF!=\"\",\"\",\"X\")","v":{"$error":"#REF!"}}]
[null,null,null,null,null,null,null,null,null,null,null,null,null,null,null,{"$f":"IF(#REF!=\"\",\"\",IF(#REF!<TODAY(),0,IF(#REF!<(TODAY()+365),1,\"X\")))","v":{"$error":"#REF!"}},{"$f":"IF(#REF!=\"\",\"\",\"X\")","v":{"$error":"#REF!"}}]
[null,null,null,null,null,null,null,null,null,null,null,null,null,null,null,{"$f":"IF(#REF!=\"\",\"\",IF(#REF!<TODAY(),0,IF(#REF!<(TODAY()+365),1,\"X\")))","v":{"$error":"#REF!"}},{"$f":"IF(#REF!=\"\",\"\",\"X\")","v":{"$error":"#REF!"}}]
[null,null,null,null,null,null,null,null,null,null,null,null,null,null,null,{"$f":"IF(#REF!=\"\",\"\",IF(#REF!<TODAY(),0,IF(#REF!<(TODAY()+365),1,\"X\")))","v":{"$error":"#REF!"}},{"$f":"IF(#REF!=\"\",\"\",\"X\")","v":{"$error":"#REF!"}}]
[null,null,null,null,null,null,null,null,null,null,null,null,null,null,null,{"$f":"IF(#REF!=\"\",\"\",IF(#REF!<TODAY(),0,IF(#REF!<(TODAY()+365),1,\"X\")))","v":{"$error":"#REF!"}},{"$f":"IF(#REF!=\"\",\"\",\"X\")","v":{"$error":"#REF!"}}]
[null,null,null,null,null,null,null,null,null,null,null,null,null,null,null,{"$f":"IF(#REF!=\"\",\"\",IF(#REF!<TODAY(),0,IF(#REF!<(TODAY()+365),1,\"X\")))","v":{"$error":"#REF!"}},{"$f":"IF(#REF!=\"\",\"\",\"X\")","v":{"$error":"#REF!"}}]
[null,null,null,null,null,null,null,null,null,null,null,null,null,null,null,{"$f":"IF(#REF!=\"\",\"\",IF(#REF!<TODAY(),0,IF(#REF!<(TODAY()+365),1,\"X\")))","v":{"$error":"#REF!"}},{"$f":"IF(#REF!=\"\",\"\",\"X\")","v":{"$error":"#REF!"}}]
[null,null,null,null,null,null,null,null,null,null,null,null,null,null,null,{"$f":"IF(#REF!=\"\",\"\",IF(#REF!<TODAY(),0,IF(#REF!<(TODAY()+365),1,\"X\")))","v":{"$error":"#REF!"}},{"$f":"IF(#REF!=\"\",\"\",\"X\")","v":{"$error":"#REF!"}}]
[null,null,null,null,null,null,null,null,null,null,null,null,null,null,null,{"$f":"IF(#REF!=\"\",\"\",IF(#REF!<TODAY(),0,IF(#REF!<(TODAY()+365),1,\"X\")))","v":{"$error":"#REF!"}},{"$f":"IF(#REF!=\"\",\"\",\"X\")","v":{"$error":"#REF!"}}]
[null,null,null,null,null,null,null,null,null,null,null,null,null,null,null,{"$f":"IF(#REF!=\"\",\"\",IF(#REF!<TODAY(),0,IF(#REF!<(TODAY()+365),1,\"X\")))","v":{"$error":"#REF!"}},{"$f":"IF(#REF!=\"\",\"\",\"X\")","v":{"$error":"#REF!"}}]
[null,null,null,null,null,null,null,null,null,null,null,null,null,null,null,{"$f":"IF(#REF!=\"\",\"\",IF(#REF!<TODAY(),0,IF(#REF!<(TODAY()+365),1,\"X\")))","v":{"$error":"#REF!"}},{"$f":"IF(#REF!=\"\",\"\",\"X\")","v":{"$error":"#REF!"}}]
[null,null,null,null,null,null,null,null,null,null,null,null,null,null,null,{"$f":"IF(#REF!=\"\",\"\",IF(#REF!<TODAY(),0,IF(#REF!<(TODAY()+365),1,\"X\")))","v":{"$error":"#REF!"}},{"$f":"IF(#REF!=\"\",\"\",\"X\")","v":{"$error":"#REF!"}}]
[null,null,null,null,null,null,null,null,null,null,null,null,null,null,null,{"$f":"IF(#REF!=\"\",\"\",IF(#REF!<TODAY(),0,IF(#REF!<(TODAY()+365),1,\"X\")))","v":{"$error":"#REF!"}},{"$f":"IF(#REF!=\"\",\"\",\"X\")","v":{"$error":"#REF!"}}]
[null,null,null,null,null,null,null,null,null,null,null,null,null,null,null,{"$f":"IF(#REF!=\"\",\"\",IF(#REF!<TODAY(),0,IF(#REF!<(TODAY()+365),1,\"X\")))","v":{"$error":"#REF!"}},{"$f":"IF(#REF!=\"\",\"\",\"X\")","v":{"$error":"#REF!"}}]
[null,null,null,null,null,null,null,null,null,null,null,null,null,null,null,{"$f":"IF(#REF!=\"\",\"\",IF(#REF!<TODAY(),0,IF(#REF!<(TODAY()+365),1,\"X\")))","v":{"$error":"#REF!"}},{"$f":"IF(#REF!=\"\",\"\",\"X\")","v":{"$error":"#REF!"}}]
[null,null,null,null,null,null,null,null,null,null,null,null,null,null,null,{"$f":"IF(#REF!=\"\",\"\",IF(#REF!<TODAY(),0,IF(#REF!<(TODAY()+365),1,\"X\")))","v":{"$error":"#REF!"}},{"$f":"IF(#REF!=\"\",\"\",\"X\")","v":{"$error":"#REF!"}}]
[null,null,null,null,null,null,null,null,null,null,null,null,null,null,null,{"$f":"IF(#REF!=\"\",\"\",IF(#REF!<TODAY(),0,IF(#REF!<(TODAY()+365),1,\"X\")))","v":{"$error":"#REF!"}},{"$f":"IF(#REF!=\"\",\"\",\"X\")","v":{"$error":"#REF!"}}]
[null,null,null,null,null,null,null,null,null,null,null,null,null,null,null,{"$f":"IF(#REF!=\"\",\"\",IF(#REF!<TODAY(),0,IF(#REF!<(TODAY()+365),1,\"X\")))","v":{"$error":"#REF!"}},{"$f":"IF(#REF!=\"\",\"\",\"X\")","v":{"$error":"#REF!"}}]
[null,null,null,null,null,null,null,null,null,null,null,null,null,null,null,{"$f":"IF(#REF!=\"\",\"\",IF(#REF!<TODAY(),0,IF(#REF!<(TODAY()+365),1,\"X\")))","v":{"$error":"#REF!"}},{"$f":"IF(#REF!=\"\",\"\",\"X\")","v":{"$error":"#REF!"}}]
[null,null,null,null,null,null,null,null,null,null,null,null,null,null,null,{"$f":"IF(#REF!=\"\",\"\",IF(#REF!<TODAY(),0,IF(#REF!<(TODAY()+365),1,\"X\")))","v":{"$error":"#REF!"}},{"$f":"IF(#REF!=\"\",\"\",\"X\")","v":{"$error":"#REF!"}}]
[null,null,null,null,null,null,null,null,null,null,null,null,null,null,null,{"$f":"IF(#REF!=\"\",\"\",IF(#REF!<TODAY(),0,IF(#REF!<(TODAY()+365),1,\"X\")))","v":{"$error":"#REF!"}},{"$f":"IF(#REF!=\"\",\"\",\"X\")","v":{"$error":"#REF!"}}]
[null,null,null,null,null,null,null,null,null,null,null,null,null,null,null,{"$f":"IF(#REF!=\"\",\"\",IF(#REF!<TODAY(),0,IF(#REF!<(TODAY()+365),1,\"X\")))","v":{"$error":"#REF!"}},{"$f":"IF(#REF!=\"\",\"\",\"X\")","v":{"$error":"#REF!"}}]
[null,null,null,null,null,null,null,null,null,null,null,null,null,null,null,{"$f":"IF(#REF!=\"\",\"\",IF(#REF!<TODAY(),0,IF(#REF!<(TODAY()+365),1,\"X\")))","v":{"$error":"#REF!"}},{"$f":"IF(#REF!=\"\",\"\",\"X\")","v":{"$error":"#REF!"}}]
[null,null,null,null,null,null,null,null,null,null,null,null,null,null,null,{"$f":"IF(#REF!=\"\",\"\",IF(#REF!<TODAY(),0,IF(#REF!<(TODAY()+365),1,\"X\")))","v":{"$error":"#REF!"}},{"$f":"IF(#REF!=\"\",\"\",\"X\")","v":{"$error":"#REF!"}}]
[null,null,null,null,null,null,null,null,null,null,null,null,null,null,null,{"$f":"IF(#REF!=\"\",\"\",IF(#REF!<TODAY(),0,IF(#REF!<(TODAY()+365),1,\"X\")))","v":{"$error":"#REF!"}},{"$f":"IF(#REF!=\"\",\"\",\"X\")","v":{"$error":"#REF!"}}]
[null,null,null,null,null,null,null,null,null,null,null,null,null,null,null,{"$f":"IF(#REF!=\"\",\"\",IF(#REF!<TODAY(),0,IF(#REF!<(TODAY()+365),1,\"X\")))","v":{"$error":"#REF!"}},{"$f":"IF(#REF!=\"\",\"\",\"X\")","v":{"$error":"#REF!"}}]
[null,null,null,null,null,null,null,null,null,null,null,null,null,null,null,{"$f":"IF(#REF!=\"\",\"\",IF(#REF!<TODAY(),0,IF(#REF!<(TODAY()+365),1,\"X\")))","v":{"$error":"#REF!"}},{"$f":"IF(#REF!=\"\",\"\",\"X\")","v":{"$error":"#REF!"}}]
[null,null,null,null,null,null,null,null,null,null,null,null,null,null,null,{"$f":"IF(#REF!=\"\",\"\",IF(#REF!<TODAY(),0,IF(#REF!<(TODAY()+365),1,\"X\")))","v":{"$error":"#REF!"}},{"$f":"IF(#REF!=\"\",\"\",\"X\")","v":{"$error":"#REF!"}}]
[null,null,null,null,null,null,null,null,null,null,null,null,null,null,null,{"$f":"IF(#REF!=\"\",\"\",IF(#REF!<TODAY(),0,IF(#REF!<(TODAY()+365),1,\"X\")))","v":{"$error":"#REF!"}},{"$f":"IF(#REF!=\"\",\"\",\"X\")","v":{"$error":"#REF!"}}]
[null,null,null,null,null,null,null,null,null,null,null,null,null,null,null,{"$f":"IF(#REF!=\"\",\"\",IF(#REF!<TODAY(),0,IF(#REF!<(TODAY()+365),1,\"X\")))","v":{"$error":"#REF!"}},{"$f":"IF(#REF!=\"\",\"\",\"X\")","v":{"$error":"#REF!"}}]
[null,null,null,null,null,null,null,null,null,null,null,null,null,null,null,{"$f":"IF(#REF!=\"\",\"\",IF(#REF!<TODAY(),0,IF(#REF!<(TODAY()+365),1,\"X\")))","v":{"$error":"#REF!"}},{"$f":"IF(#REF!=\"\",\"\",\"X\")","v":{"$error":"#REF!"}}]
[null,null,null,null,null,null,null,null,null,null,null,null,null,null,null,{"$f":"IF(#REF!=\"\",\"\",IF(#REF!<TODAY(),0,IF(#REF!<(TODAY()+365),1,\"X\")))","v":{"$error":"#REF!"}},{"$f":"IF(#REF!=\"\",\"\",\"X\")","v":{"$error":"#REF!"}}]
[null,null,null,null,null,null,null,null,null,null,null,null,null,null,null,{"$f":"IF(#REF!=\"\",\"\",IF(#REF!<TODAY(),0,IF(#REF!<(TODAY()+365),1,\"X\")))","v":{"$error":"#REF!"}},{"$f":"IF(#REF!=\"\",\"\",\"X\")","v":{"$error":"#REF!"}}]
[null,null,null,null,null,null,null,null,null,null,null,null,null,null,null,{"$f":"IF(#REF!=\"\",\"\",IF(#REF!<TODAY(),0,IF(#REF!<(TODAY()+365),1,\"X\")))","v":{"$error":"#REF!"}},{"$f":"IF(#REF!=\"\",\"\",\"X\")","v":{"$error":"#REF!"}}]
[null,null,null,null,null,null,null,null,null,null,null,null,null,null,null,{"$f":"IF(#REF!=\"\",\"\",IF(#REF!<TODAY(),0,IF(#REF!<(TODAY()+365),1,\"X\")))","v":{"$error":"#REF!"}},{"$f":"IF(#REF!=\"\",\"\",\"X\")","v":{"$error":"#REF!"}}]
[null,null,null,null,null,null,null,null,null,null,null,null,null,null,null,{"$f":"IF(#REF!=\"\",\"\",IF(#REF!<TODAY(),0,IF(#REF!<(TODAY()+365),1,\"X\")))","v":{"$error":"#REF!"}},{"$f":"IF(#REF!=\"\",\"\",\"X\")","v":{"$error":"#REF!"}}]
[null,null,null,null,null,null,null,null,null,null,null,null,null,null,null,{"$f":"IF(#REF!=\"\",\"\",IF(#REF!<TODAY(),0,IF(#REF!<(TODAY()+365),1,\"X\")))","v":{"$error":"#REF!"}},{"$f":"IF(#REF!=\"\",\"\",\"X\")","v":{"$error":"#REF!"}}]
[null,null,null,null,null,null,null,null,null,null,null,null,null,null,null,{"$f":"IF(#REF!=\"\",\"\",IF(#REF!<TODAY(),0,IF(#REF!<(TODAY()+365),1,\"X\")))","v":{"$error":"#REF!"}},{"$f":"IF(#REF!=\"\",\"\",\"X\")","v":{"$error":"#REF!"}}]
[null,null,null,null,null,null,null,null,null,null,null,null,null,null,null,{"$f":"IF(#REF!=\"\",\"\",IF(#REF!<TODAY(),0,IF(#REF!<(TODAY()+365),1,\"X\")))","v":{"$error":"#REF!"}},{"$f":"IF(#REF!=\"\",\"\",\"X\")","v":{"$error":"#REF!"}}]
[null,null,null,null,null,null,null,null,null,null,null,null,null,null,null,{"$f":"IF(#REF!=\"\",\"\",IF(#REF!<TODAY(),0,IF(#REF!<(TODAY()+365),1,\"X\")))","v":{"$error":"#REF!"}},{"$f":"IF(#REF!=\"\",\"\",\"X\")","v":{"$error":"#REF!"}}]
[null,null,null,null,null,null,null,null,null,null,null,null,null,null,null,{"$f":"IF(#REF!=\"\",\"\",IF(#REF!<TODAY(),0,IF(#REF!<(TODAY()+365),1,\"X\")))","v":{"$error":"#REF!"}},{"$f":"IF(#REF!=\"\",\"\",\"X\")","v":{"$error":"#REF!"}}]
[null,null,null,null,null,null,null,null,null,null,null,null,null,null,null,{"$f":"IF(#REF!=\"\",\"\",IF(#REF!<TODAY(),0,IF(#REF!<(TODAY()+365),1,\"X\")))","v":{"$error":"#REF!"}},{"$f":"IF(#REF!=\"\",\"\",\"X\")","v":{"$error":"#REF!"}}]
[null,null,null,null,null,null,null,null,null,null,null,null,null,null,null,{"$f":"IF(#REF!=\"\",\"\",IF(#REF!<TODAY(),0,IF(#REF!<(TODAY()+365),1,\"X\")))","v":{"$error":"#REF!"}},{"$f":"IF(#REF!=\"\",\"\",\"X\")","v":{"$error":"#REF!"}}]
[null,null,null,null,null,null,null,null,null,null,null,null,null,null,null,{"$f":"IF(#REF!=\"\",\"\",IF(#REF!<TODAY(),0,IF(#REF!<(TODAY()+365),1,\"X\")))","v":{"$error":"#REF!"}},{"$f":"IF(#REF!=\"\",\"\",\"X\")","v":{"$error":"#REF!"}}]
[null,null,null,null,null,null,null,null,null,null,null,null,null,null,null,{"$f":"IF(#REF!=\"\",\"\",IF(#REF!<TODAY(),0,IF(#REF!<(TODAY()+365),1,\"X\")))","v":{"$error":"#REF!"}},{"$f":"IF(#REF!=\"\",\"\",\"X\")","v":{"$error":"#REF!"}}]
[null,null,null,null,null,null,null,null,null,null,null,null,null,null,null,{"$f":"IF(#REF!=\"\",\"\",IF(#REF!<TODAY(),0,IF(#REF!<(TODAY()+365),1,\"X\")))","v":{"$error":"#REF!"}},{"$f":"IF(#REF!=\"\",\"\",\"X\")","v":{"$error":"#REF!"}}]
[null,null,null,null,null,null,null,null,null,null,null,null,null,null,null,{"$f":"IF(#REF!=\"\",\"\",IF(#REF!<TODAY(),0,IF(#REF!<(TODAY()+365),1,\"X\")))","v":{"$error":"#REF!"}},{"$f":"IF(#REF!=\"\",\"\",\"X\")","v":{"$error":"#REF!"}}]
[null,null,null,null,null,null,null,null,null,null,null,null,null,null,null,{"$f":"IF(#REF!=\"\",\"\",IF(#REF!<TODAY(),0,IF(#REF!<(TODAY()+365),1,\"X\")))","v":{"$error":"#REF!"}},{"$f":"IF(#REF!=\"\",\"\",\"X\")","v":{"$error":"#REF!"}}]
[null,null,null,null,null,null,null,null,null,null,null,null,null,null,null,{"$f":"IF(#REF!=\"\",\"\",IF(#REF!<TODAY(),0,IF(#REF!<(TODAY()+365),1,\"X\")))","v":{"$error":"#REF!"}},{"$f":"IF(#REF!=\"\",\"\",\"X\")","v":{"$error":"#REF!"}}]
[null,null,null,null,null,null,null,null,null,null,null,null,null,null,null,{"$f":"IF(#REF!=\"\",\"\",IF(#REF!<TODAY(),0,IF(#REF!<(TODAY()+365),1,\"X\")))","v":{"$error":"#REF!"}},{"$f":"IF(#REF!=\"\",\"\",\"X\")","v":{"$error":"#REF!"}}]
[null,null,null,null,null,null,null,null,null,null,null,null,null,null,null,{"$f":"IF(#REF!=\"\",\"\",IF(#REF!<TODAY(),0,IF(#REF!<(TODAY()+365),1,\"X\")))","v":{"$error":"#REF!"}},{"$f":"IF(#REF!=\"\",\"\",\"X\")","v":{"$error":"#REF!"}}]
[null,null,null,null,null,null,null,null,null,null,null,null,null,null,null,{"$f":"IF(#REF!=\"\",\"\",IF(#REF!<TODAY(),0,IF(#REF!<(TODAY()+365),1,\"X\")))","v":{"$error":"#REF!"}},{"$f":"IF(#REF!=\"\",\"\",\"X\")","v":{"$error":"#REF!"}}]
[null,null,null,null,null,null,null,null,null,null,null,null,null,null,null,{"$f":"IF(#REF!=\"\",\"\",IF(#REF!<TODAY(),0,IF(#REF!<(TODAY()+365),1,\"X\")))","v":{"$error":"#REF!"}},{"$f":"IF(#REF!=\"\",\"\",\"X\")","v":{"$error":"#REF!"}}]
[null,null,null,null,null,null,null,null,null,null,null,null,null,null,null,{"$f":"IF(#REF!=\"\",\"\",IF(#REF!<TODAY(),0,IF(#REF!<(TODAY()+365),1,\"X\")))","v":{"$error":"#REF!"}},{"$f":"IF(#REF!=\"\",\"\",\"X\")","v":{"$error":"#REF!"}}]
[null,null,null,null,null,null,null,null,null,null,null,null,null,null,null,{"$f":"IF(#REF!=\"\",\"\",IF(#REF!<TODAY(),0,IF(#REF!<(TODAY()+365),1,\"X\")))","v":{"$error":"#REF!"}},{"$f":"IF(#REF!=\"\",\"\",\"X\")","v":{"$error":"#REF!"}}]
[null,null,null,null,null,null,null,null,null,null,null,null,null,null,null,{"$f":"IF(#REF!=\"\",\"\",IF(#REF!<TODAY(),0,IF(#REF!<(TODAY()+365),1,\"X\")))","v":{"$error":"#REF!"}},{"$f":"IF(#REF!=\"\",\"\",\"X\")","v":{"$error":"#REF!"}}]
[null,null,null,null,null,null,null,null,null,null,null,null,null,null,null,{"$f":"IF(#REF!=\"\",\"\",IF(#REF!<TODAY(),0,IF(#REF!<(TODAY()+365),1,\"X\")))","v":{"$error":"#REF!"}},{"$f":"IF(#REF!=\"\",\"\",\"X\")","v":{"$error":"#REF!"}}]
[null,null,null,null,null,null,null,null,null,null,null,null,null,null,null,{"$f":"IF(#REF!=\"\",\"\",IF(#REF!<TODAY(),0,IF(#REF!<(TODAY()+365),1,\"X\")))","v":{"$error":"#REF!"}},{"$f":"IF(#REF!=\"\",\"\",\"X\")","v":{"$error":"#REF!"}}]
[null,null,null,null,null,null,null,null,null,null,null,null,null,null,null,{"$f":"IF(#REF!=\"\",\"\",IF(#REF!<TODAY(),0,IF(#REF!<(TODAY()+365),1,\"X\")))","v":{"$error":"#REF!"}},{"$f":"IF(#REF!=\"\",\"\",\"X\")","v":{"$error":"#REF!"}}]
[null,null,null,null,null,null,null,null,null,null,null,null,null,null,null,{"$f":"IF(#REF!=\"\",\"\",IF(#REF!<TODAY(),0,IF(#REF!<(TODAY()+365),1,\"X\")))","v":{"$error":"#REF!"}},{"$f":"IF(#REF!=\"\",\"\",\"X\")","v":{"$error":"#REF!"}}]
[null,null,null,null,null,null,null,null,null,null,null,null,null,null,null,{"$f":"IF(#REF!=\"\",\"\",IF(#REF!<TODAY(),0,IF(#REF!<(TODAY()+365),1,\"X\")))","v":{"$error":"#REF!"}},{"$f":"IF(#REF!=\"\",\"\",\"X\")","v":{"$error":"#REF!"}}]
[null,null,null,null,null,null,null,null,null,null,null,null,null,null,null,{"$f":"IF(#REF!=\"\",\"\",IF(#REF!<TODAY(),0,IF(#REF!<(TODAY()+365),1,\"X\")))","v":{"$error":"#REF!"}},{"$f":"IF(#REF!=\"\",\"\",\"X\")","v":{"$error":"#REF!"}}]
[null,null,null,null,null,null,null,null,null,null,null,null,null,null,null,{"$f":"IF(#REF!=\"\",\"\",IF(#REF!<TODAY(),0,IF(#REF!<(TODAY()+365),1,\"X\")))","v":{"$error":"#REF!"}},{"$f":"IF(#REF!=\"\",\"\",\"X\")","v":{"$error":"#REF!"}}]
[null,null,null,null,null,null,null,null,null,null,null,null,null,null,null,{"$f":"IF(#REF!=\"\",\"\",IF(#REF!<TODAY(),0,IF(#REF!<(TODAY()+365),1,\"X\")))","v":{"$error":"#REF!"}},{"$f":"IF(#REF!=\"\",\"\",\"X\")","v":{"$error":"#REF!"}}]
[null,null,null,null,null,null,null,null,null,null,null,null,null,null,null,{"$f":"IF(#REF!=\"\",\"\",IF(#REF!<TODAY(),0,IF(#REF!<(TODAY()+365),1,\"X\")))","v":{"$error":"#REF!"}},{"$f":"IF(#REF!=\"\",\"\",\"X\")","v":{"$error":"#REF!"}}]
[null,null,null,null,null,null,null,null,null,null,null,null,null,null,null,{"$f":"IF(#REF!=\"\",\"\",IF(#REF!<TODAY(),0,IF(#REF!<(TODAY()+365),1,\"X\")))","v":{"$error":"#REF!"}},{"$f":"IF(#REF!=\"\",\"\",\"X\")","v":{"$error":"#REF!"}}]
[null,null,null,null,null,null,null,null,null,null,null,null,null,null,null,{"$f":"IF(#REF!=\"\",\"\",IF(#REF!<TODAY(),0,IF(#REF!<(TODAY()+365),1,\"X\")))","v":{"$error":"#REF!"}},{"$f":"IF(#REF!=\"\",\"\",\"X\")","v":{"$error":"#REF!"}}]
[null,null,null,null,null,null,null,null,null,null,null,null,null,null,null,{"$f":"IF(#REF!=\"\",\"\",IF(#REF!<TODAY(),0,IF(#REF!<(TODAY()+365),1,\"X\")))","v":{"$error":"#REF!"}},{"$f":"IF(#REF!=\"\",\"\",\"X\")","v":{"$error":"#REF!"}}]
[null,null,null,null,null,null,null,null,null,null,null,null,null,null,null,{"$f":"IF(#REF!=\"\",\"\",IF(#REF!<TODAY(),0,IF(#REF!<(TODAY()+365),1,\"X\")))","v":{"$error":"#REF!"}},{"$f":"IF(#REF!=\"\",\"\",\"X\")","v":{"$error":"#REF!"}}]
[null,null,null,null,null,null,null,null,null,null,null,null,null,null,null,{"$f":"IF(#REF!=\"\",\"\",IF(#REF!<TODAY(),0,IF(#REF!<(TODAY()+365),1,\"X\")))","v":{"$error":"#REF!"}},{"$f":"IF(#REF!=\"\",\"\",\"X\")","v":{"$error":"#REF!"}}]
[null,null,null,null,null,null,null,null,null,null,null,null,null,null,null,{"$f":"IF(#REF!=\"\",\"\",IF(#REF!<TODAY(),0,IF(#REF!<(TODAY()+365),1,\"X\")))","v":{"$error":"#REF!"}},{"$f":"IF(#REF!=\"\",\"\",\"X\")","v":{"$error":"#REF!"}}]
[null,null,null,null,null,null,null,null,null,null,null,null,null,null,null,{"$f":"IF(#REF!=\"\",\"\",IF(#REF!<TODAY(),0,IF(#REF!<(TODAY()+365),1,\"X\")))","v":{"$error":"#REF!"}},{"$f":"IF(#REF!=\"\",\"\",\"X\")","v":{"$error":"#REF!"}}]
[null,null,null,null,null,null,null,null,null,null,null,null,null,null,null,{"$f":"IF(#REF!=\"\",\"\",IF(#REF!<TODAY(),0,IF(#REF!<(TODAY()+365),1,\"X\")))","v":{"$error":"#REF!"}},{"$f":"IF(#REF!=\"\",\"\",\"X\")","v":{"$error":"#REF!"}}]
[null,null,null,null,null,null,null,null,null,null,null,null,null,null,null,{"$f":"IF(#REF!=\"\",\"\",IF(#REF!<TODAY(),0,IF(#REF!<(TODAY()+365),1,\"X\")))","v":{"$error":"#REF!"}},{"$f":"IF(#REF!=\"\",\"\",\"X\")","v":{"$error":"#REF!"}}]
[null,null,null,null,null,null,null,null,null,null,null,null,null,null,null,{"$f":"IF(#REF!=\"\",\"\",IF(#REF!<TODAY(),0,IF(#REF!<(TODAY()+365),1,\"X\")))","v":{"$error":"#REF!"}},{"$f":"IF(#REF!=\"\",\"\",\"X\")","v":{"$error":"#REF!"}}]
[null,null,null,null,null,null,null,null,null,null,null,null,null,null,null,{"$f":"IF(#REF!=\"\",\"\",IF(#REF!<TODAY(),0,IF(#REF!<(TODAY()+365),1,\"X\")))","v":{"$error":"#REF!"}},{"$f":"IF(#REF!=\"\",\"\",\"X\")","v":{"$error":"#REF!"}}]
[null,null,null,null,null,null,null,null,null,null,null,null,null,null,null,{"$f":"IF(#REF!=\"\",\"\",IF(#REF!<TODAY(),0,IF(#REF!<(TODAY()+365),1,\"X\")))","v":{"$error":"#REF!"}},{"$f":"IF(#REF!=\"\",\"\",\"X\")","v":{"$error":"#REF!"}}]
[null,null,null,null,null,null,null,null,null,null,null,null,null,null,null,{"$f":"IF(#REF!=\"\",\"\",IF(#REF!<TODAY(),0,IF(#REF!<(TODAY()+365),1,\"X\")))","v":{"$error":"#REF!"}},{"$f":"IF(#REF!=\"\",\"\",\"X\")","v":{"$error":"#REF!"}}]
[null,null,null,null,null,null,null,null,null,null,null,null,null,null,null,{"$f":"IF(#REF!=\"\",\"\",IF(#REF!<TODAY(),0,IF(#REF!<(TODAY()+365),1,\"X\")))","v":{"$error":"#REF!"}},{"$f":"IF(#REF!=\"\",\"\",\"X\")","v":{"$error":"#REF!"}}]
[null,null,null,null,null,null,null,null,null,null,null,null,null,null,null,{"$f":"IF(#REF!=\"\",\"\",IF(#REF!<TODAY(),0,IF(#REF!<(TODAY()+365),1,\"X\")))","v":{"$error":"#REF!"}},{"$f":"IF(#REF!=\"\",\"\",\"X\")","v":{"$error":"#REF!"}}]
[null,null,null,null,null,null,null,null,null,null,null,null,null,null,null,{"$f":"IF(#REF!=\"\",\"\",IF(#REF!<TODAY(),0,IF(#REF!<(TODAY()+365),1,\"X\")))","v":{"$error":"#REF!"}},{"$f":"IF(#REF!=\"\",\"\",\"X\")","v":{"$error":"#REF!"}}]
[null,null,null,null,null,null,null,null,null,null,null,null,null,null,null,{"$f":"IF(#REF!=\"\",\"\",IF(#REF!<TODAY(),0,IF(#REF!<(TODAY()+365),1,\"X\")))","v":{"$error":"#REF!"}},{"$f":"IF(#REF!=\"\",\"\",\"X\")","v":{"$error":"#REF!"}}]
[null,null,null,null,null,null,null,null,null,null,null,null,null,null,null,{"$f":"IF(#REF!=\"\",\"\",IF(#REF!<TODAY(),0,IF(#REF!<(TODAY()+365),1,\"X\")))","v":{"$error":"#REF!"}},{"$f":"IF(#REF!=\"\",\"\",\"X\")","v":{"$error":"#REF!"}}]
[null,null,null,null,null,null,null,null,null,null,null,null,null,null,null,{"$f":"IF(#REF!=\"\",\"\",IF(#REF!<TODAY(),0,IF(#REF!<(TODAY()+365),1,\"X\")))","v":{"$error":"#REF!"}},{"$f":"IF(#REF!=\"\",\"\",\"X\")","v":{"$error":"#REF!"}}]
[null,null,null,null,null,null,null,null,null,null,null,null,null,null,null,{"$f":"IF(#REF!=\"\",\"\",IF(#REF!<TODAY(),0,IF(#REF!<(TODAY()+365),1,\"X\")))","v":{"$error":"#REF!"}},{"$f":"IF(#REF!=\"\",\"\",\"X\")","v":{"$error":"#REF!"}}]
[null,null,null,null,null,null,null,null,null,null,null,null,null,null,null,{"$f":"IF(#REF!=\"\",\"\",IF(#REF!<TODAY(),0,IF(#REF!<(TODAY()+365),1,\"X\")))","v":{"$error":"#REF!"}},{"$f":"IF(#REF!=\"\",\"\",\"X\")","v":{"$error":"#REF!"}}]
[null,null,null,null,null,null,null,null,null,null,null,null,null,null,null,{"$f":"IF(#REF!=\"\",\"\",IF(#REF!<TODAY(),0,IF(#REF!<(TODAY()+365),1,\"X\")))","v":{"$error":"#REF!"}},{"$f":"IF(#REF!=\"\",\"\",\"X\")","v":{"$error":"#REF!"}}]
[null,null,null,null,null,null,null,null,null,null,null,null,null,null,null,{"$f":"IF(#REF!=\"\",\"\",IF(#REF!<TODAY(),0,IF(#REF!<(TODAY()+365),1,\"X\")))","v":{"$error":"#REF!"}},{"$f":"IF(#REF!=\"\",\"\",\"X\")","v":{"$error":"#REF!"}}]
[null,null,null,null,null,null,null,null,null,null,null,null,null,null,null,{"$f":"IF(#REF!=\"\",\"\",IF(#REF!<TODAY(),0,IF(#REF!<(TODAY()+365),1,\"X\")))","v":{"$error":"#REF!"}},{"$f":"IF(#REF!=\"\",\"\",\"X\")","v":{"$error":"#REF!"}}]
[null,null,null,null,null,null,null,null,null,null,null,null,null,null,null,{"$f":"IF(#REF!=\"\",\"\",IF(#REF!<TODAY(),0,IF(#REF!<(TODAY()+365),1,\"X\")))","v":{"$error":"#REF!"}},{"$f":"IF(#REF!=\"\",\"\",\"X\")","v":{"$error":"#REF!"}}]
[null,null,null,null,null,null,null,null,null,null,null,null,null,null,null,{"$f":"IF(#REF!=\"\",\"\",IF(#REF!<TODAY(),0,IF(#REF!<(TODAY()+365),1,\"X\")))","v":{"$error":"#REF!"}},{"$f":"IF(#REF!=\"\",\"\",\"X\")","v":{"$error":"#REF!"}}]
[null,null,null,null,null,null,null,null,null,null,null,null,null,null,null,{"$f":"IF(#REF!=\"\",\"\",IF(#REF!<TODAY(),0,IF(#REF!<(TODAY()+365),1,\"X\")))","v":{"$error":"#REF!"}},{"$f":"IF(#REF!=\"\",\"\",\"X\")","v":{"$error":"#REF!"}}]
[null,null,null,null,null,null,null,null,null,null,null,null,null,null,null,{"$f":"IF(#REF!=\"\",\"\",IF(#REF!<TODAY(),0,IF(#REF!<(TODAY()+365),1,\"X\")))","v":{"$error":"#REF!"}},{"$f":"IF(#REF!=\"\",\"\",\"X\")","v":{"$error":"#REF!"}}]
[null,null,null,null,null,null,null,null,null,null,null,null,null,null,null,{"$f":"IF(#REF!=\"\",\"\",IF(#REF!<TODAY(),0,IF(#REF!<(TODAY()+365),1,\"X\")))","v":{"$error":"#REF!"}},{"$f":"IF(#REF!=\"\",\"\",\"X\")","v":{"$error":"#REF!"}}]
[null,null,null,null,null,null,null,null,null,null,null,null,null,null,null,{"$f":"IF(#REF!=\"\",\"\",IF(#REF!<TODAY(),0,IF(#REF!<(TODAY()+365),1,\"X\")))","v":{"$error":"#REF!"}},{"$f":"IF(#REF!=\"\",\"\",\"X\")","v":{"$error":"#REF!"}}]
[null,null,null,null,null,null,null,null,null,null,null,null,null,null,null,{"$f":"IF(#REF!=\"\",\"\",IF(#REF!<TODAY(),0,IF(#REF!<(TODAY()+365),1,\"X\")))","v":{"$error":"#REF!"}},{"$f":"IF(#REF!=\"\",\"\",\"X\")","v":{"$error":"#REF!"}}]
[null,null,null,null,null,null,null,null,null,null,null,null,null,null,null,{"$f":"IF(#REF!=\"\",\"\",IF(#REF!<TODAY(),0,IF(#REF!<(TODAY()+365),1,\"X\")))","v":{"$error":"#REF!"}},{"$f":"IF(#REF!=\"\",\"\",\"X\")","v":{"$error":"#REF!"}}]
[null,null,null,null,null,null,null,null,null,null,null,null,null,null,null,{"$f":"IF(#REF!=\"\",\"\",IF(#REF!<TODAY(),0,IF(#REF!<(TODAY()+365),1,\"X\")))","v":{"$error":"#REF!"}},{"$f":"IF(#REF!=\"\",\"\",\"X\")","v":{"$error":"#REF!"}}]
[null,null,null,null,null,null,null,null,null,null,null,null,null,null,null,{"$f":"IF(#REF!=\"\",\"\",IF(#REF!<TODAY(),0,IF(#REF!<(TODAY()+365),1,\"X\")))","v":{"$error":"#REF!"}},{"$f":"IF(#REF!=\"\",\"\",\"X\")","v":{"$error":"#REF!"}}]
[null,null,null,null,null,null,null,null,null,null,null,null,null,null,null,{"$f":"IF(#REF!=\"\",\"\",IF(#REF!<TODAY(),0,IF(#REF!<(TODAY()+365),1,\"X\")))","v":{"$error":"#REF!"}},{"$f":"IF(#REF!=\"\",\"\",\"X\")","v":{"$error":"#REF!"}}]
[null,null,null,null,null,null,null,null,null,null,null,null,null,null,null,{"$f":"IF(#REF!=\"\",\"\",IF(#REF!<TODAY(),0,IF(#REF!<(TODAY()+365),1,\"X\")))","v":{"$error":"#REF!"}},{"$f":"IF(#REF!=\"\",\"\",\"X\")","v":{"$error":"#REF!"}}]
[null,null,null,null,null,null,null,null,null,null,null,null,null,null,null,{"$f":"IF(#REF!=\"\",\"\",IF(#REF!<TODAY(),0,IF(#REF!<(TODAY()+365),1,\"X\")))","v":{"$error":"#REF!"}},{"$f":"IF(#REF!=\"\",\"\",\"X\")","v":{"$error":"#REF!"}}]
[null,null,null,null,null,null,null,null,null,null,null,null,null,null,null,{"$f":"IF(#REF!=\"\",\"\",IF(#REF!<TODAY(),0,IF(#REF!<(TODAY()+365),1,\"X\")))","v":{"$error":"#REF!"}},{"$f":"IF(#REF!=\"\",\"\",\"X\")","v":{"$error":"#REF!"}}]
[null,null,null,null,null,null,null,null,null,null,null,null,null,null,null,{"$f":"IF(#REF!=\"\",\"\",IF(#REF!<TODAY(),0,IF(#REF!<(TODAY()+365),1,\"X\")))","v":{"$error":"#REF!"}},{"$f":"IF(#REF!=\"\",\"\",\"X\")","v":{"$error":"#REF!"}}]
[null,null,null,null,null,null,null,null,null,null,null,null,null,null,null,{"$f":"IF(#REF!=\"\",\"\",IF(#REF!<TODAY(),0,IF(#REF!<(TODAY()+365),1,\"X\")))","v":{"$error":"#REF!"}},{"$f":"IF(#REF!=\"\",\"\",\"X\")","v":{"$error":"#REF!"}}]
[null,null,null,null,null,null,null,null,null,null,null,null,null,null,null,{"$f":"IF(#REF!=\"\",\"\",IF(#REF!<TODAY(),0,IF(#REF!<(TODAY()+365),1,\"X\")))","v":{"$error":"#REF!"}},{"$f":"IF(#REF!=\"\",\"\",\"X\")","v":{"$error":"#REF!"}}]
[null,null,null,null,null,null,null,null,null,null,null,null,null,null,null,{"$f":"IF(#REF!=\"\",\"\",IF(#REF!<TODAY(),0,IF(#REF!<(TODAY()+365),1,\"X\")))","v":{"$error":"#REF!"}},{"$f":"IF(#REF!=\"\",\"\",\"X\")","v":{"$error":"#REF!"}}]
[null,null,null,null,null,null,null,null,null,null,null,null,null,null,null,{"$f":"IF(#REF!=\"\",\"\",IF(#REF!<TODAY(),0,IF(#REF!<(TODAY()+365),1,\"X\")))","v":{"$error":"#REF!"}},{"$f":"IF(#REF!=\"\",\"\",\"X\")","v":{"$error":"#REF!"}}]
[null,null,null,null,null,null,null,null,null,null,null,null,null,null,null,{"$f":"IF(#REF!=\"\",\"\",IF(#REF!<TODAY(),0,IF(#REF!<(TODAY()+365),1,\"X\")))","v":{"$error":"#REF!"}},{"$f":"IF(#REF!=\"\",\"\",\"X\")","v":{"$error":"#REF!"}}]
[null,null,null,null,null,null,null,null,null,null,null,null,null,null,null,{"$f":"IF(#REF!=\"\",\"\",IF(#REF!<TODAY(),0,IF(#REF!<(TODAY()+365),1,\"X\")))","v":{"$error":"#REF!"}},{"$f":"IF(#REF!=\"\",\"\",\"X\")","v":{"$error":"#REF!"}}]
[null,null,null,null,null,null,null,null,null,null,null,null,null,null,null,{"$f":"IF(#REF!=\"\",\"\",IF(#REF!<TODAY(),0,IF(#REF!<(TODAY()+365),1,\"X\")))","v":{"$error":"#REF!"}},{"$f":"IF(#REF!=\"\",\"\",\"X\")","v":{"$error":"#REF!"}}]
[null,null,null,null,null,null,null,null,null,null,null,null,null,null,null,{"$f":"IF(#REF!=\"\",\"\",IF(#REF!<TODAY(),0,IF(#REF!<(TODAY()+365),1,\"X\")))","v":{"$error":"#REF!"}},{"$f":"IF(#REF!=\"\",\"\",\"X\")","v":{"$error":"#REF!"}}]
[null,null,null,null,null,null,null,null,null,null,null,null,null,null,null,{"$f":"IF(#REF!=\"\",\"\",IF(#REF!<TODAY(),0,IF(#REF!<(TODAY()+365),1,\"X\")))","v":{"$error":"#REF!"}},{"$f":"IF(#REF!=\"\",\"\",\"X\")","v":{"$error":"#REF!"}}]
[null,null,null,null,null,null,null,null,null,null,null,null,null,null,null,{"$f":"IF(#REF!=\"\",\"\",IF(#REF!<TODAY(),0,IF(#REF!<(TODAY()+365),1,\"X\")))","v":{"$error":"#REF!"}},{"$f":"IF(#REF!=\"\",\"\",\"X\")","v":{"$error":"#REF!"}}]
[null,null,null,null,null,null,null,null,null,null,null,null,null,null,null,{"$f":"IF(#REF!=\"\",\"\",IF(#REF!<TODAY(),0,IF(#REF!<(TODAY()+365),1,\"X\")))","v":{"$error":"#REF!"}},{"$f":"IF(#REF!=\"\",\"\",\"X\")","v":{"$error":"#REF!"}}]
[null,null,null,null,null,null,null,null,null,null,null,null,null,null,null,{"$f":"IF(#REF!=\"\",\"\",IF(#REF!<TODAY(),0,IF(#REF!<(TODAY()+365),1,\"X\")))","v":{"$error":"#REF!"}},{"$f":"IF(#REF!=\"\",\"\",\"X\")","v":{"$error":"#REF!"}}]
[null,null,null,null,null,null,null,null,null,null,null,null,null,null,null,{"$f":"IF(#REF!=\"\",\"\",IF(#REF!<TODAY(),0,IF(#REF!<(TODAY()+365),1,\"X\")))","v":{"$error":"#REF!"}},{"$f":"IF(#REF!=\"\",\"\",\"X\")","v":{"$error":"#REF!"}}]
[null,null,null,null,null,null,null,null,null,null,null,null,null,null,null,{"$f":"IF(#REF!=\"\",\"\",IF(#REF!<TODAY(),0,IF(#REF!<(TODAY()+365),1,\"X\")))","v":{"$error":"#REF!"}},{"$f":"IF(#REF!=\"\",\"\",\"X\")","v":{"$error":"#REF!"}}]
[null,null,null,null,null,null,null,null,null,null,null,null,null,null,null,{"$f":"IF(#REF!=\"\",\"\",IF(#REF!<TODAY(),0,IF(#REF!<(TODAY()+365),1,\"X\")))","v":{"$error":"#REF!"}},{"$f":"IF(#REF!=\"\",\"\",\"X\")","v":{"$error":"#REF!"}}]
[null,null,null,null,null,null,null,null,null,null,null,null,null,null,null,{"$f":"IF(#REF!=\"\",\"\",IF(#REF!<TODAY(),0,IF(#REF!<(TODAY()+365),1,\"X\")))","v":{"$error":"#REF!"}},{"$f":"IF(#REF!=\"\",\"\",\"X\")","v":{"$error":"#REF!"}}]
[null,null,null,null,null,null,null,null,null,null,null,null,null,null,null,{"$f":"IF(#REF!=\"\",\"\",IF(#REF!<TODAY(),0,IF(#REF!<(TODAY()+365),1,\"X\")))","v":{"$error":"#REF!"}},{"$f":"IF(#REF!=\"\",\"\",\"X\")","v":{"$error":"#REF!"}}]
[null,null,null,null,null,null,null,null,null,null,null,null,null,null,null,{"$f":"IF(#REF!=\"\",\"\",IF(#REF!<TODAY(),0,IF(#REF!<(TODAY()+365),1,\"X\")))","v":{"$error":"#REF!"}},{"$f":"IF(#REF!=\"\",\"\",\"X\")","v":{"$error":"#REF!"}}]
[null,null,null,null,null,null,null,null,null,null,null,null,null,null,null,{"$f":"IF(#REF!=\"\",\"\",IF(#REF!<TODAY(),0,IF(#REF!<(TODAY()+365),1,\"X\")))","v":{"$error":"#REF!"}},{"$f":"IF(#REF!=\"\",\"\",\"X\")","v":{"$error":"#REF!"}}]
[null,null,null,null,null,null,null,null,null,null,null,null,null,null,null,{"$f":"IF(#REF!=\"\",\"\",IF(#REF!<TODAY(),0,IF(#REF!<(TODAY()+365),1,\"X\")))","v":{"$error":"#REF!"}},{"$f":"IF(#REF!=\"\",\"\",\"X\")","v":{"$error":"#REF!"}}]
[null,null,null,null,null,null,null,null,null,null,null,null,null,null,null,{"$f":"IF(#REF!=\"\",\"\",IF(#REF!<TODAY(),0,IF(#REF!<(TODAY()+365),1,\"X\")))","v":{"$error":"#REF!"}},{"$f":"IF(#REF!=\"\",\"\",\"X\")","v":{"$error":"#REF!"}}]
[null,null,null,null,null,null,null,null,null,null,null,null,null,null,null,{"$f":"IF(#REF!=\"\",\"\",IF(#REF!<TODAY(),0,IF(#REF!<(TODAY()+365),1,\"X\")))","v":{"$error":"#REF!"}},{"$f":"IF(#REF!=\"\",\"\",\"X\")","v":{"$error":"#REF!"}}]
[null,null,null,null,null,null,null,null,null,null,null,null,null,null,null,{"$f":"IF(#REF!=\"\",\"\",IF(#REF!<TODAY(),0,IF(#REF!<(TODAY()+365),1,\"X\")))","v":{"$error":"#REF!"}},{"$f":"IF(#REF!=\"\",\"\",\"X\")","v":{"$error":"#REF!"}}]
[null,null,null,null,null,null,null,null,null,null,null,null,null,null,null,{"$f":"IF(#REF!=\"\",\"\",IF(#REF!<TODAY(),0,IF(#REF!<(TODAY()+365),1,\"X\")))","v":{"$error":"#REF!"}},{"$f":"IF(#REF!=\"\",\"\",\"X\")","v":{"$error":"#REF!"}}]
[null,null,null,null,null,null,null,null,null,null,null,null,null,null,null,{"$f":"IF(#REF!=\"\",\"\",IF(#REF!<TODAY(),0,IF(#REF!<(TODAY()+365),1,\"X\")))","v":{"$error":"#REF!"}},{"$f":"IF(#REF!=\"\",\"\",\"X\")","v":{"$error":"#REF!"}}]
[null,null,null,null,null,null,null,null,null,null,null,null,null,null,null,{"$f":"IF(#REF!=\"\",\"\",IF(#REF!<TODAY(),0,IF(#REF!<(TODAY()+365),1,\"X\")))","v":{"$error":"#REF!"}},{"$f":"IF(#REF!=\"\",\"\",\"X\")","v":{"$error":"#REF!"}}]
[null,null,null,null,null,null,null,null,null,null,null,null,null,null,null,{"$f":"IF(#REF!=\"\",\"\",IF(#REF!<TODAY(),0,IF(#REF!<(TODAY()+365),1,\"X\")))","v":{"$error":"#REF!"}},{"$f":"IF(#REF!=\"\",\"\",\"X\")","v":{"$error":"#REF!"}}]
[null,null,null,null,null,null,null,null,null,null,null,null,null,null,null,{"$f":"IF(#REF!=\"\",\"\",IF(#REF!<TODAY(),0,IF(#REF!<(TODAY()+365),1,\"X\")))","v":{"$error":"#REF!"}},{"$f":"IF(#REF!=\"\",\"\",\"X\")","v":{"$error":"#REF!"}}]
[null,null,null,null,null,null,null,null,null,null,null,null,null,null,null,{"$f":"IF(#REF!=\"\",\"\",IF(#REF!<TODAY(),0,IF(#REF!<(TODAY()+365),1,\"X\")))","v":{"$error":"#REF!"}},{"$f":"IF(#REF!=\"\",\"\",\"X\")","v":{"$error":"#REF!"}}]
[null,null,null,null,null,null,null,null,null,null,null,null,null,null,null,{"$f":"IF(#REF!=\"\",\"\",IF(#REF!<TODAY(),0,IF(#REF!<(TODAY()+365),1,\"X\")))","v":{"$error":"#REF!"}},{"$f":"IF(#REF!=\"\",\"\",\"X\")","v":{"$error":"#REF!"}}]
[null,null,null,null,null,null,null,null,null,null,null,null,null,null,null,{"$f":"IF(#REF!=\"\",\"\",IF(#REF!<TODAY(),0,IF(#REF!<(TODAY()+365),1,\"X\")))","v":{"$error":"#REF!"}},{"$f":"IF(#REF!=\"\",\"\",\"X\")","v":{"$error":"#REF!"}}]
[null,null,null,null,null,null,null,null,null,null,null,null,null,null,null,{"$f":"IF(#REF!=\"\",\"\",IF(#REF!<TODAY(),0,IF(#REF!<(TODAY()+365),1,\"X\")))","v":{"$error":"#REF!"}},{"$f":"IF(#REF!=\"\",\"\",\"X\")","v":{"$error":"#REF!"}}]
[null,null,null,null,null,null,null,null,null,null,null,null,null,null,null,{"$f":"IF(#REF!=\"\",\"\",IF(#REF!<TODAY(),0,IF(#REF!<(TODAY()+365),1,\"X\")))","v":{"$error":"#REF!"}},{"$f":"IF(#REF!=\"\",\"\",\"X\")","v":{"$error":"#REF!"}}]
[null,null,null,null,null,null,null,null,null,null,null,null,null,null,null,{"$f":"IF(#REF!=\"\",\"\",IF(#REF!<TODAY(),0,IF(#REF!<(TODAY()+365),1,\"X\")))","v":{"$error":"#REF!"}},{"$f":"IF(#REF!=\"\",\"\",\"X\")","v":{"$error":"#REF!"}}]
[null,null,null,null,null,null,null,null,null,null,null,null,null,null,null,{"$f":"IF(#REF!=\"\",\"\",IF(#REF!<TODAY(),0,IF(#REF!<(TODAY()+365),1,\"X\")))","v":{"$error":"#REF!"}},{"$f":"IF(#REF!=\"\",\"\",\"X\")","v":{"$error":"#REF!"}}]
[null,null,null,null,null,null,null,null,null,null,null,null,null,null,null,{"$f":"IF(#REF!=\"\",\"\",IF(#REF!<TODAY(),0,IF(#REF!<(TODAY()+365),1,\"X\")))","v":{"$error":"#REF!"}},{"$f":"IF(#REF!=\"\",\"\",\"X\")","v":{"$error":"#REF!"}}]
[null,null,null,null,null,null,null,null,null,null,null,null,null,null,null,{"$f":"IF(#REF!=\"\",\"\",IF(#REF!<TODAY(),0,IF(#REF!<(TODAY()+365),1,\"X\")))","v":{"$error":"#REF!"}},{"$f":"IF(#REF!=\"\",\"\",\"X\")","v":{"$error":"#REF!"}}]
[null,null,null,null,null,null,null,null,null,null,null,null,null,null,null,{"$f":"IF(#REF!=\"\",\"\",IF(#REF!<TODAY(),0,IF(#REF!<(TODAY()+365),1,\"X\")))","v":{"$error":"#REF!"}},{"$f":"IF(#REF!=\"\",\"\",\"X\")","v":{"$error":"#REF!"}}]
[null,null,null,null,null,null,null,null,null,null,null,null,null,null,null,{"$f":"IF(#REF!=\"\",\"\",IF(#REF!<TODAY(),0,IF(#REF!<(TODAY()+365),1,\"X\")))","v":{"$error":"#REF!"}},{"$f":"IF(#REF!=\"\",\"\",\"X\")","v":{"$error":"#REF!"}}]
[null,null,null,null,null,null,null,null,null,null,null,null,null,null,null,{"$f":"IF(#REF!=\"\",\"\",IF(#REF!<TODAY(),0,IF(#REF!<(TODAY()+365),1,\"X\")))","v":{"$error":"#REF!"}},{"$f":"IF(#REF!=\"\",\"\",\"X\")","v":{"$error":"#REF!"}}]
[null,null,null,null,null,null,null,null,null,null,null,null,null,null,null,{"$f":"IF(#REF!=\"\",\"\",IF(#REF!<TODAY(),0,IF(#REF!<(TODAY()+365),1,\"X\")))","v":{"$error":"#REF!"}},{"$f":"IF(#REF!=\"\",\"\",\"X\")","v":{"$error":"#REF!"}}]
[null,null,null,null,null,null,null,null,null,null,null,null,null,null,null,{"$f":"IF(#REF!=\"\",\"\",IF(#REF!<TODAY(),0,IF(#REF!<(TODAY()+365),1,\"X\")))","v":{"$error":"#REF!"}},{"$f":"IF(#REF!=\"\",\"\",\"X\")","v":{"$error":"#REF!"}}]
[null,null,null,null,null,null,null,null,null,null,null,null,null,null,null,{"$f":"IF(#REF!=\"\",\"\",IF(#REF!<TODAY(),0,IF(#REF!<(TODAY()+365),1,\"X\")))","v":{"$error":"#REF!"}},{"$f":"IF(#REF!=\"\",\"\",\"X\")","v":{"$error":"#REF!"}}]
[null,null,null,null,null,null,null,null,null,null,null,null,null,null,null,{"$f":"IF(#REF!=\"\",\"\",IF(#REF!<TODAY(),0,IF(#REF!<(TODAY()+365),1,\"X\")))","v":{"$error":"#REF!"}},{"$f":"IF(#REF!=\"\",\"\",\"X\")","v":{"$error":"#REF!"}}]
[null,null,null,null,null,null,null,null,null,null,null,null,null,null,null,{"$f":"IF(#REF!=\"\",\"\",IF(#REF!<TODAY(),0,IF(#REF!<(TODAY()+365),1,\"X\")))","v":{"$error":"#REF!"}},{"$f":"IF(#REF!=\"\",\"\",\"X\")","v":{"$error":"#REF!"}}]
[null,null,null,null,null,null,null,null,null,null,null,null,null,null,null,{"$f":"IF(#REF!=\"\",\"\",IF(#REF!<TODAY(),0,IF(#REF!<(TODAY()+365),1,\"X\")))","v":{"$error":"#REF!"}},{"$f":"IF(#REF!=\"\",\"\",\"X\")","v":{"$error":"#REF!"}}]
[null,null,null,null,null,null,null,null,null,null,null,null,null,null,null,{"$f":"IF(#REF!=\"\",\"\",IF(#REF!<TODAY(),0,IF(#REF!<(TODAY()+365),1,\"X\")))","v":{"$error":"#REF!"}},{"$f":"IF(#REF!=\"\",\"\",\"X\")","v":{"$error":"#REF!"}}]
[null,null,null,null,null,null,null,null,null,null,null,null,null,null,null,{"$f":"IF(#REF!=\"\",\"\",IF(#REF!<TODAY(),0,IF(#REF!<(TODAY()+365),1,\"X\")))","v":{"$error":"#REF!"}},{"$f":"IF(#REF!=\"\",\"\",\"X\")","v":{"$error":"#REF!"}}]
[null,null,null,null,null,null,null,null,null,null,null,null,null,null,null,{"$f":"IF(#REF!=\"\",\"\",IF(#REF!<TODAY(),0,IF(#REF!<(TODAY()+365),1,\"X\")))","v":{"$error":"#REF!"}},{"$f":"IF(#REF!=\"\",\"\",\"X\")","v":{"$error":"#REF!"}}]
[null,null,null,null,null,null,null,null,null,null,null,null,null,null,null,{"$f":"IF(#REF!=\"\",\"\",IF(#REF!<TODAY(),0,IF(#REF!<(TODAY()+365),1,\"X\")))","v":{"$error":"#REF!"}},{"$f":"IF(#REF!=\"\",\"\",\"X\")","v":{"$error":"#REF!"}}]
[null,null,null,null,null,null,null,null,null,null,null,null,null,null,null,{"$f":"IF(#REF!=\"\",\"\",IF(#REF!<TODAY(),0,IF(#REF!<(TODAY()+365),1,\"X\")))","v":{"$error":"#REF!"}},{"$f":"IF(#REF!=\"\",\"\",\"X\")","v":{"$error":"#REF!"}}]
[null,null,null,null,null,null,null,null,null,null,null,null,null,null,null,{"$f":"IF(#REF!=\"\",\"\",IF(#REF!<TODAY(),0,IF(#REF!<(TODAY()+365),1,\"X\")))","v":{"$error":"#REF!"}},{"$f":"IF(#REF!=\"\",\"\",\"X\")","v":{"$error":"#REF!"}}]
[null,null,null,null,null,null,null,null,null,null,null,null,null,null,null,{"$f":"IF(#REF!=\"\",\"\",IF(#REF!<TODAY(),0,IF(#REF!<(TODAY()+365),1,\"X\")))","v":{"$error":"#REF!"}},{"$f":"IF(#REF!=\"\",\"\",\"X\")","v":{"$error":"#REF!"}}]
[null,null,null,null,null,null,null,null,null,null,null,null,null,null,null,{"$f":"IF(#REF!=\"\",\"\",IF(#REF!<TODAY(),0,IF(#REF!<(TODAY()+365),1,\"X\")))","v":{"$error":"#REF!"}},{"$f":"IF(#REF!=\"\",\"\",\"X\")","v":{"$error":"#REF!"}}]
[null,null,null,null,null,null,null,null,null,null,null,null,null,null,null,{"$f":"IF(#REF!=\"\",\"\",IF(#REF!<TODAY(),0,IF(#REF!<(TODAY()+365),1,\"X\")))","v":{"$error":"#REF!"}},{"$f":"IF(#REF!=\"\",\"\",\"X\")","v":{"$error":"#REF!"}}]
[null,null,null,null,null,null,null,null,null,null,null,null,null,null,null,{"$f":"IF(#REF!=\"\",\"\",IF(#REF!<TODAY(),0,IF(#REF!<(TODAY()+365),1,\"X\")))","v":{"$error":"#REF!"}},{"$f":"IF(#REF!=\"\",\"\",\"X\")","v":{"$error":"#REF!"}}]
[null,null,null,null,null,null,null,null,null,null,null,null,null,null,null,{"$f":"IF(#REF!=\"\",\"\",IF(#REF!<TODAY(),0,IF(#REF!<(TODAY()+365),1,\"X\")))","v":{"$error":"#REF!"}},{"$f":"IF(#REF!=\"\",\"\",\"X\")","v":{"$error":"#REF!"}}]
[null,null,null,null,null,null,null,null,null,null,null,null,null,null,null,{"$f":"IF(#REF!=\"\",\"\",IF(#REF!<TODAY(),0,IF(#REF!<(TODAY()+365),1,\"X\")))","v":{"$error":"#REF!"}},{"$f":"IF(#REF!=\"\",\"\",\"X\")","v":{"$error":"#REF!"}}]
[null,null,null,null,null,null,null,null,null,null,null,null,null,null,null,{"$f":"IF(#REF!=\"\",\"\",IF(#REF!<TODAY(),0,IF(#REF!<(TODAY()+365),1,\"X\")))","v":{"$error":"#REF!"}},{"$f":"IF(#REF!=\"\",\"\",\"X\")","v":{"$error":"#REF!"}}]
[null,null,null,null,null,null,null,null,null,null,null,null,null,null,null,{"$f":"IF(#REF!=\"\",\"\",IF(#REF!<TODAY(),0,IF(#REF!<(TODAY()+365),1,\"X\")))","v":{"$error":"#REF!"}},{"$f":"IF(#REF!=\"\",\"\",\"X\")","v":{"$error":"#REF!"}}]
[null,null,null,null,null,null,null,null,null,null,null,null,null,null,null,{"$f":"IF(#REF!=\"\",\"\",IF(#REF!<TODAY(),0,IF(#REF!<(TODAY()+365),1,\"X\")))","v":{"$error":"#REF!"}},{"$f":"IF(#REF!=\"\",\"\",\"X\")","v":{"$error":"#REF!"}}]
[null,null,null,null,null,null,null,null,null,null,null,null,null,null,null,{"$f":"IF(#REF!=\"\",\"\",IF(#REF!<TODAY(),0,IF(#REF!<(TODAY()+365),1,\"X\")))","v":{"$error":"#REF!"}},{"$f":"IF(#REF!=\"\",\"\",\"X\")","v":{"$error":"#REF!"}}]
[null,null,null,null,null,null,null,null,null,null,null,null,null,null,null,{"$f":"IF(#REF!=\"\",\"\",IF(#REF!<TODAY(),0,IF(#REF!<(TODAY()+365),1,\"X\")))","v":{"$error":"#REF!"}},{"$f":"IF(#REF!=\"\",\"\",\"X\")","v":{"$error":"#REF!"}}]
[null,null,null,null,null,null,null,null,null,null,null,null,null,null,null,{"$f":"IF(#REF!=\"\",\"\",IF(#REF!<TODAY(),0,IF(#REF!<(TODAY()+365),1,\"X\")))","v":{"$error":"#REF!"}},{"$f":"IF(#REF!=\"\",\"\",\"X\")","v":{"$error":"#REF!"}}]
[null,null,null,null,null,null,null,null,null,null,null,null,null,null,null,{"$f":"IF(#REF!=\"\",\"\",IF(#REF!<TODAY(),0,IF(#REF!<(TODAY()+365),1,\"X\")))","v":{"$error":"#REF!"}},{"$f":"IF(#REF!=\"\",\"\",\"X\")","v":{"$error":"#REF!"}}]
[null,null,null,null,null,null,null,null,null,null,null,null,null,null,null,{"$f":"IF(#REF!=\"\",\"\",IF(#REF!<TODAY(),0,IF(#REF!<(TODAY()+365),1,\"X\")))","v":{"$error":"#REF!"}},{"$f":"IF(#REF!=\"\",\"\",\"X\")","v":{"$error":"#REF!"}}]
[null,null,null,null,null,null,null,null,null,null,null,null,null,null,null,{"$f":"IF(#REF!=\"\",\"\",IF(#REF!<TODAY(),0,IF(#REF!<(TODAY()+365),1,\"X\")))","v":{"$error":"#REF!"}},{"$f":"IF(#REF!=\"\",\"\",\"X\")","v":{"$error":"#REF!"}}]
[null,null,null,null,null,null,null,null,null,null,null,null,null,null,null,{"$f":"IF(#REF!=\"\",\"\",IF(#REF!<TODAY(),0,IF(#REF!<(TODAY()+365),1,\"X\")))","v":{"$error":"#REF!"}},{"$f":"IF(#REF!=\"\",\"\",\"X\")","v":{"$error":"#REF!"}}]
[null,null,null,null,null,null,null,null,null,null,null,null,null,null,null,{"$f":"IF(#REF!=\"\",\"\",IF(#REF!<TODAY(),0,IF(#REF!<(TODAY()+365),1,\"X\")))","v":{"$error":"#REF!"}},{"$f":"IF(#REF!=\"\",\"\",\"X\")","v":{"$error":"#REF!"}}]
[null,null,null,null,null,null,null,null,null,null,null,null,null,null,null,{"$f":"IF(#REF!=\"\",\"\",IF(#REF!<TODAY(),0,IF(#REF!<(TODAY()+365),1,\"X\")))","v":{"$error":"#REF!"}},{"$f":"IF(#REF!=\"\",\"\",\"X\")","v":{"$error":"#REF!"}}]
[null,null,null,null,null,null,null,null,null,null,null,null,null,null,null,{"$f":"IF(#REF!=\"\",\"\",IF(#REF!<TODAY(),0,IF(#REF!<(TODAY()+365),1,\"X\")))","v":{"$error":"#REF!"}},{"$f":"IF(#REF!=\"\",\"\",\"X\")","v":{"$error":"#REF!"}}]
[null,null,null,null,null,null,null,null,null,null,null,null,null,null,null,{"$f":"IF(#REF!=\"\",\"\",IF(#REF!<TODAY(),0,IF(#REF!<(TODAY()+365),1,\"X\")))","v":{"$error":"#REF!"}},{"$f":"IF(#REF!=\"\",\"\",\"X\")","v":{"$error":"#REF!"}}]
[null,null,null,null,null,null,null,null,null,null,null,null,null,null,null,{"$f":"IF(#REF!=\"\",\"\",IF(#REF!<TODAY(),0,IF(#REF!<(TODAY()+365),1,\"X\")))","v":{"$error":"#REF!"}},{"$f":"IF(#REF!=\"\",\"\",\"X\")","v":{"$error":"#REF!"}}]
[null,null,null,null,null,null,null,null,null,null,null,null,null,null,null,{"$f":"IF(#REF!=\"\",\"\",IF(#REF!<TODAY(),0,IF(#REF!<(TODAY()+365),1,\"X\")))","v":{"$error":"#REF!"}},{"$f":"IF(#REF!=\"\",\"\",\"X\")","v":{"$error":"#REF!"}}]
[null,null,null,null,null,null,null,null,null,null,null,null,null,null,null,{"$f":"IF(#REF!=\"\",\"\",IF(#REF!<TODAY(),0,IF(#REF!<(TODAY()+365),1,\"X\")))","v":{"$error":"#REF!"}},{"$f":"IF(#REF!=\"\",\"\",\"X\")","v":{"$error":"#REF!"}}]
[null,null,null,null,null,null,null,null,null,null,null,null,null,null,null,{"$f":"IF(#REF!=\"\",\"\",IF(#REF!<TODAY(),0,IF(#REF!<(TODAY()+365),1,\"X\")))","v":{"$error":"#REF!"}},{"$f":"IF(#REF!=\"\",\"\",\"X\")","v":{"$error":"#REF!"}}]
[null,null,null,null,null,null,null,null,null,null,null,null,null,null,null,{"$f":"IF(#REF!=\"\",\"\",IF(#REF!<TODAY(),0,IF(#REF!<(TODAY()+365),1,\"X\")))","v":{"$error":"#REF!"}},{"$f":"IF(#REF!=\"\",\"\",\"X\")","v":{"$error":"#REF!"}}]
[null,null,null,null,null,null,null,null,null,null,null,null,null,null,null,{"$f":"IF(#REF!=\"\",\"\",IF(#REF!<TODAY(),0,IF(#REF!<(TODAY()+365),1,\"X\")))","v":{"$error":"#REF!"}},{"$f":"IF(#REF!=\"\",\"\",\"X\")","v":{"$error":"#REF!"}}]
[null,null,null,null,null,null,null,null,null,null,null,null,null,null,null,{"$f":"IF(#REF!=\"\",\"\",IF(#REF!<TODAY(),0,IF(#REF!<(TODAY()+365),1,\"X\")))","v":{"$error":"#REF!"}},{"$f":"IF(#REF!=\"\",\"\",\"X\")","v":{"$error":"#REF!"}}]
[null,null,null,null,null,null,null,null,null,null,null,null,null,null,null,{"$f":"IF(#REF!=\"\",\"\",IF(#REF!<TODAY(),0,IF(#REF!<(TODAY()+365),1,\"X\")))","v":{"$error":"#REF!"}},{"$f":"IF(#REF!=\"\",\"\",\"X\")","v":{"$error":"#REF!"}}]
[null,null,null,null,null,null,null,null,null,null,null,null,null,null,null,{"$f":"IF(#REF!=\"\",\"\",IF(#REF!<TODAY(),0,IF(#REF!<(TODAY()+365),1,\"X\")))","v":{"$error":"#REF!"}},{"$f":"IF(#REF!=\"\",\"\",\"X\")","v":{"$error":"#REF!"}}]
[null,null,null,null,null,null,null,null,null,null,null,null,null,null,null,{"$f":"IF(#REF!=\"\",\"\",IF(#REF!<TODAY(),0,IF(#REF!<(TODAY()+365),1,\"X\")))","v":{"$error":"#REF!"}},{"$f":"IF(#REF!=\"\",\"\",\"X\")","v":{"$error":"#REF!"}}]
[null,null,null,null,null,null,null,null,null,null,null,null,null,null,null,{"$f":"IF(#REF!=\"\",\"\",IF(#REF!<TODAY(),0,IF(#REF!<(TODAY()+365),1,\"X\")))","v":{"$error":"#REF!"}},{"$f":"IF(#REF!=\"\",\"\",\"X\")","v":{"$error":"#REF!"}}]
[null,null,null,null,null,null,null,null,null,null,null,null,null,null,null,{"$f":"IF(#REF!=\"\",\"\",IF(#REF!<TODAY(),0,IF(#REF!<(TODAY()+365),1,\"X\")))","v":{"$error":"#REF!"}},{"$f":"IF(#REF!=\"\",\"\",\"X\")","v":{"$error":"#REF!"}}]
[null,null,null,null,null,null,null,null,null,null,null,null,null,null,null,{"$f":"IF(#REF!=\"\",\"\",IF(#REF!<TODAY(),0,IF(#REF!<(TODAY()+365),1,\"X\")))","v":{"$error":"#REF!"}},{"$f":"IF(#REF!=\"\",\"\",\"X\")","v":{"$error":"#REF!"}}]
[null,null,null,null,null,null,null,null,null,null,null,null,null,null,null,{"$f":"IF(#REF!=\"\",\"\",IF(#REF!<TODAY(),0,IF(#REF!<(TODAY()+365),1,\"X\")))","v":{"$error":"#REF!"}},{"$f":"IF(#REF!=\"\",\"\",\"X\")","v":{"$error":"#REF!"}}]
[null,null,null,null,null,null,null,null,null,null,null,null,null,null,null,{"$f":"IF(#REF!=\"\",\"\",IF(#REF!<TODAY(),0,IF(#REF!<(TODAY()+365),1,\"X\")))","v":{"$error":"#REF!"}},{"$f":"IF(#REF!=\"\",\"\",\"X\")","v":{"$error":"#REF!"}}]
[null,null,null,null,null,null,null,null,null,null,null,null,null,null,null,{"$f":"IF(#REF!=\"\",\"\",IF(#REF!<TODAY(),0,IF(#REF!<(TODAY()+365),1,\"X\")))","v":{"$error":"#REF!"}},{"$f":"IF(#REF!=\"\",\"\",\"X\")","v":{"$error":"#REF!"}}]
[null,null,null,null,null,null,null,null,null,null,null,null,null,null,null,{"$f":"IF(#REF!=\"\",\"\",IF(#REF!<TODAY(),0,IF(#REF!<(TODAY()+365),1,\"X\")))","v":{"$error":"#REF!"}},{"$f":"IF(#REF!=\"\",\"\",\"X\")","v":{"$error":"#REF!"}}]
[null,null,null,null,null,null,null,null,null,null,null,null,null,null,null,{"$f":"IF(#REF!=\"\",\"\",IF(#REF!<TODAY(),0,IF(#REF!<(TODAY()+365),1,\"X\")))","v":{"$error":"#REF!"}},{"$f":"IF(#REF!=\"\",\"\",\"X\")","v":{"$error":"#REF!"}}]
[null,null,null,null,null,null,null,null,null,null,null,null,null,null,null,{"$f":"IF(#REF!=\"\",\"\",IF(#REF!<TODAY(),0,IF(#REF!<(TODAY()+365),1,\"X\")))","v":{"$error":"#REF!"}},{"$f":"IF(#REF!=\"\",\"\",\"X\")","v":{"$error":"#REF!"}}]
[null,null,null,null,null,null,null,null,null,null,null,null,null,null,null,{"$f":"IF(#REF!=\"\",\"\",IF(#REF!<TODAY(),0,IF(#REF!<(TODAY()+365),1,\"X\")))","v":{"$error":"#REF!"}},{"$f":"IF(#REF!=\"\",\"\",\"X\")","v":{"$error":"#REF!"}}]
[null,null,null,null,null,null,null,null,null,null,null,null,null,null,null,{"$f":"IF(#REF!=\"\",\"\",IF(#REF!<TODAY(),0,IF(#REF!<(TODAY()+365),1,\"X\")))","v":{"$error":"#REF!"}},{"$f":"IF(#REF!=\"\",\"\",\"X\")","v":{"$error":"#REF!"}}]
[null,null,null,null,null,null,null,null,null,null,null,null,null,null,null,{"$f":"IF(#REF!=\"\",\"\",IF(#REF!<TODAY(),0,IF(#REF!<(TODAY()+365),1,\"X\")))","v":{"$error":"#REF!"}},{"$f":"IF(#REF!=\"\",\"\",\"X\")","v":{"$error":"#REF!"}}]
[null,null,null,null,null,null,null,null,null,null,null,null,null,null,null,{"$f":"IF(#REF!=\"\",\"\",IF(#REF!<TODAY(),0,IF(#REF!<(TODAY()+365),1,\"X\")))","v":{"$error":"#REF!"}},{"$f":"IF(#REF!=\"\",\"\",\"X\")","v":{"$error":"#REF!"}}]
[null,null,null,null,null,null,null,null,null,null,null,null,null,null,null,{"$f":"IF(#REF!=\"\",\"\",IF(#REF!<TODAY(),0,IF(#REF!<(TODAY()+365),1,\"X\")))","v":{"$error":"#REF!"}},{"$f":"IF(#REF!=\"\",\"\",\"X\")","v":{"$error":"#REF!"}}]
[null,null,null,null,null,null,null,null,null,null,null,null,null,null,null,{"$f":"IF(#REF!=\"\",\"\",IF(#REF!<TODAY(),0,IF(#REF!<(TODAY()+365),1,\"X\")))","v":{"$error":"#REF!"}},{"$f":"IF(#REF!=\"\",\"\",\"X\")","v":{"$error":"#REF!"}}]
[null,null,null,null,null,null,null,null,null,null,null,null,null,null,null,{"$f":"IF(#REF!=\"\",\"\",IF(#REF!<TODAY(),0,IF(#REF!<(TODAY()+365),1,\"X\")))","v":{"$error":"#REF!"}},{"$f":"IF(#REF!=\"\",\"\",\"X\")","v":{"$error":"#REF!"}}]
[null,null,null,null,null,null,null,null,null,null,null,null,null,null,null,{"$f":"IF(#REF!=\"\",\"\",IF(#REF!<TODAY(),0,IF(#REF!<(TODAY()+365),1,\"X\")))","v":{"$error":"#REF!"}},{"$f":"IF(#REF!=\"\",\"\",\"X\")","v":{"$error":"#REF!"}}]
[null,null,null,null,null,null,null,null,null,null,null,null,null,null,null,{"$f":"IF(#REF!=\"\",\"\",IF(#REF!<TODAY(),0,IF(#REF!<(TODAY()+365),1,\"X\")))","v":{"$error":"#REF!"}},{"$f":"IF(#REF!=\"\",\"\",\"X\")","v":{"$error":"#REF!"}}]
[null,null,null,null,null,null,null,null,null,null,null,null,null,null,null,{"$f":"IF(#REF!=\"\",\"\",IF(#REF!<TODAY(),0,IF(#REF!<(TODAY()+365),1,\"X\")))","v":{"$error":"#REF!"}},{"$f":"IF(#REF!=\"\",\"\",\"X\")","v":{"$error":"#REF!"}}]
[null,null,null,null,null,null,null,null,null,null,null,null,null,null,null,{"$f":"IF(#REF!=\"\",\"\",IF(#REF!<TODAY(),0,IF(#REF!<(TODAY()+365),1,\"X\")))","v":{"$error":"#REF!"}},{"$f":"IF(#REF!=\"\",\"\",\"X\")","v":{"$error":"#REF!"}}]
[null,null,null,null,null,null,null,null,null,null,null,null,null,null,null,{"$f":"IF(#REF!=\"\",\"\",IF(#REF!<TODAY(),0,IF(#REF!<(TODAY()+365),1,\"X\")))","v":{"$error":"#REF!"}},{"$f":"IF(#REF!=\"\",\"\",\"X\")","v":{"$error":"#REF!"}}]
[null,null,null,null,null,null,null,null,null,null,null,null,null,null,null,{"$f":"IF(#REF!=\"\",\"\",IF(#REF!<TODAY(),0,IF(#REF!<(TODAY()+365),1,\"X\")))","v":{"$error":"#REF!"}},{"$f":"IF(#REF!=\"\",\"\",\"X\")","v":{"$error":"#REF!"}}]
[null,null,null,null,null,null,null,null,null,null,null,null,null,null,null,{"$f":"IF(#REF!=\"\",\"\",IF(#REF!<TODAY(),0,IF(#REF!<(TODAY()+365),1,\"X\")))","v":{"$error":"#REF!"}},{"$f":"IF(#REF!=\"\",\"\",\"X\")","v":{"$error":"#REF!"}}]
[null,null,null,null,null,null,null,null,null,null,null,null,null,null,null,{"$f":"IF(#REF!=\"\",\"\",IF(#REF!<TODAY(),0,IF(#REF!<(TODAY()+365),1,\"X\")))","v":{"$error":"#REF!"}},{"$f":"IF(#REF!=\"\",\"\",\"X\")","v":{"$error":"#REF!"}}]
[null,null,null,null,null,null,null,null,null,null,null,null,null,null,null,{"$f":"IF(#REF!=\"\",\"\",IF(#REF!<TODAY(),0,IF(#REF!<(TODAY()+365),1,\"X\")))","v":{"$error":"#REF!"}},{"$f":"IF(#REF!=\"\",\"\",\"X\")","v":{"$error":"#REF!"}}]
[null,null,null,null,null,null,null,null,null,null,null,null,null,null,null,{"$f":"IF(#REF!=\"\",\"\",IF(#REF!<TODAY(),0,IF(#REF!<(TODAY()+365),1,\"X\")))","v":{"$error":"#REF!"}},{"$f":"IF(#REF!=\"\",\"\",\"X\")","v":{"$error":"#REF!"}}]
[null,null,null,null,null,null,null,null,null,null,null,null,null,null,null,{"$f":"IF(#REF!=\"\",\"\",IF(#REF!<TODAY(),0,IF(#REF!<(TODAY()+365),1,\"X\")))","v":{"$error":"#REF!"}},{"$f":"IF(#REF!=\"\",\"\",\"X\")","v":{"$error":"#REF!"}}]
[null,null,null,null,null,null,null,null,null,null,null,null,null,null,null,{"$f":"IF(#REF!=\"\",\"\",IF(#REF!<TODAY(),0,IF(#REF!<(TODAY()+365),1,\"X\")))","v":{"$error":"#REF!"}},{"$f":"IF(#REF!=\"\",\"\",\"X\")","v":{"$error":"#REF!"}}]
[null,null,null,null,null,null,null,null,null,null,null,null,null,null,null,{"$f":"IF(#REF!=\"\",\"\",IF(#REF!<TODAY(),0,IF(#REF!<(TODAY()+365),1,\"X\")))","v":{"$error":"#REF!"}},{"$f":"IF(#REF!=\"\",\"\",\"X\")","v":{"$error":"#REF!"}}]
[null,null,null,null,null,null,null,null,null,null,null,null,null,null,null,{"$f":"IF(#REF!=\"\",\"\",IF(#REF!<TODAY(),0,IF(#REF!<(TODAY()+365),1,\"X\")))","v":{"$error":"#REF!"}},{"$f":"IF(#REF!=\"\",\"\",\"X\")","v":{"$error":"#REF!"}}]
[null,null,null,null,null,null,null,null,null,null,null,null,null,null,null,{"$f":"IF(#REF!=\"\",\"\",IF(#REF!<TODAY(),0,IF(#REF!<(TODAY()+365),1,\"X\")))","v":{"$error":"#REF!"}},{"$f":"IF(#REF!=\"\",\"\",\"X\")","v":{"$error":"#REF!"}}]
[null,null,null,null,null,null,null,null,null,null,null,null,null,null,null,{"$f":"IF(#REF!=\"\",\"\",IF(#REF!<TODAY(),0,IF(#REF!<(TODAY()+365),1,\"X\")))","v":{"$error":"#REF!"}},{"$f":"IF(#REF!=\"\",\"\",\"X\")","v":{"$error":"#REF!"}}]
[null,null,null,null,null,null,null,null,null,null,null,null,null,null,null,{"$f":"IF(#REF!=\"\",\"\",IF(#REF!<TODAY(),0,IF(#REF!<(TODAY()+365),1,\"X\")))","v":{"$error":"#REF!"}},{"$f":"IF(#REF!=\"\",\"\",\"X\")","v":{"$error":"#REF!"}}]
[null,null,null,null,null,null,null,null,null,null,null,null,null,null,null,{"$f":"IF(#REF!=\"\",\"\",IF(#REF!<TODAY(),0,IF(#REF!<(TODAY()+365),1,\"X\")))","v":{"$error":"#REF!"}},{"$f":"IF(#REF!=\"\",\"\",\"X\")","v":{"$error":"#REF!"}}]
[null,null,null,null,null,null,null,null,null,null,null,null,null,null,null,{"$f":"IF(#REF!=\"\",\"\",IF(#REF!<TODAY(),0,IF(#REF!<(TODAY()+365),1,\"X\")))","v":{"$error":"#REF!"}},{"$f":"IF(#REF!=\"\",\"\",\"X\")","v":{"$error":"#REF!"}}]
[null,null,null,null,null,null,null,null,null,null,null,null,null,null,null,{"$f":"IF(#REF!=\"\",\"\",IF(#REF!<TODAY(),0,IF(#REF!<(TODAY()+365),1,\"X\")))","v":{"$error":"#REF!"}},{"$f":"IF(#REF!=\"\",\"\",\"X\")","v":{"$error":"#REF!"}}]
[null,null,null,null,null,null,null,null,null,null,null,null,null,null,null,{"$f":"IF(#REF!=\"\",\"\",IF(#REF!<TODAY(),0,IF(#REF!<(TODAY()+365),1,\"X\")))","v":{"$error":"#REF!"}},{"$f":"IF(#REF!=\"\",\"\",\"X\")","v":{"$error":"#REF!"}}]
[null,null,null,null,null,null,null,null,null,null,null,null,null,null,null,{"$f":"IF(#REF!=\"\",\"\",IF(#REF!<TODAY(),0,IF(#REF!<(TODAY()+365),1,\"X\")))","v":{"$error":"#REF!"}},{"$f":"IF(#REF!=\"\",\"\",\"X\")","v":{"$error":"#REF!"}}]
[null,null,null,null,null,null,null,null,null,null,null,null,null,null,null,{"$f":"IF(#REF!=\"\",\"\",IF(#REF!<TODAY(),0,IF(#REF!<(TODAY()+365),1,\"X\")))","v":{"$error":"#REF!"}},{"$f":"IF(#REF!=\"\",\"\",\"X\")","v":{"$error":"#REF!"}}]
[null,null,null,null,null,null,null,null,null,null,null,null,null,null,null,{"$f":"IF(#REF!=\"\",\"\",IF(#REF!<TODAY(),0,IF(#REF!<(TODAY()+365),1,\"X\")))","v":{"$error":"#REF!"}},{"$f":"IF(#REF!=\"\",\"\",\"X\")","v":{"$error":"#REF!"}}]
[null,null,null,null,null,null,null,null,null,null,null,null,null,null,null,{"$f":"IF(#REF!=\"\",\"\",IF(#REF!<TODAY(),0,IF(#REF!<(TODAY()+365),1,\"X\")))","v":{"$error":"#REF!"}},{"$f":"IF(#REF!=\"\",\"\",\"X\")","v":{"$error":"#REF!"}}]
[null,null,null,null,null,null,null,null,null,null,null,null,null,null,null,{"$f":"IF(#REF!=\"\",\"\",IF(#REF!<TODAY(),0,IF(#REF!<(TODAY()+365),1,\"X\")))","v":{"$error":"#REF!"}},{"$f":"IF(#REF!=\"\",\"\",\"X\")","v":{"$error":"#REF!"}}]
[null,null,null,null,null,null,null,null,null,null,null,null,null,null,null,{"$f":"IF(#REF!=\"\",\"\",IF(#REF!<TODAY(),0,IF(#REF!<(TODAY()+365),1,\"X\")))","v":{"$error":"#REF!"}},{"$f":"IF(#REF!=\"\",\"\",\"X\")","v":{"$error":"#REF!"}}]
[null,null,null,null,null,null,null,null,null,null,null,null,null,null,null,{"$f":"IF(#REF!=\"\",\"\",IF(#REF!<TODAY(),0,IF(#REF!<(TODAY()+365),1,\"X\")))","v":{"$error":"#REF!"}},{"$f":"IF(#REF!=\"\",\"\",\"X\")","v":{"$error":"#REF!"}}]
[null,null,null,null,null,null,null,null,null,null,null,null,null,null,null,{"$f":"IF(#REF!=\"\",\"\",IF(#REF!<TODAY(),0,IF(#REF!<(TODAY()+365),1,\"X\")))","v":{"$error":"#REF!"}},{"$f":"IF(#REF!=\"\",\"\",\"X\")","v":{"$error":"#REF!"}}]
[null,null,null,null,null,null,null,null,null,null,null,null,null,null,null,{"$f":"IF(#REF!=\"\",\"\",IF(#REF!<TODAY(),0,IF(#REF!<(TODAY()+365),1,\"X\")))","v":{"$error":"#REF!"}},{"$f":"IF(#REF!=\"\",\"\",\"X\")","v":{"$error":"#REF!"}}]
[null,null,null,null,null,null,null,null,null,null,null,null,null,null,null,{"$f":"IF(#REF!=\"\",\"\",IF(#REF!<TODAY(),0,IF(#REF!<(TODAY()+365),1,\"X\")))","v":{"$error":"#REF!"}},{"$f":"IF(#REF!=\"\",\"\",\"X\")","v":{"$error":"#REF!"}}]
[null,null,null,null,null,null,null,null,null,null,null,null,null,null,null,{"$f":"IF(#REF!=\"\",\"\",IF(#REF!<TODAY(),0,IF(#REF!<(TODAY()+365),1,\"X\")))","v":{"$error":"#REF!"}},{"$f":"IF(#REF!=\"\",\"\",\"X\")","v":{"$error":"#REF!"}}]
[null,null,null,null,null,null,null,null,null,null,null,null,null,null,null,{"$f":"IF(#REF!=\"\",\"\",IF(#REF!<TODAY(),0,IF(#REF!<(TODAY()+365),1,\"X\")))","v":{"$error":"#REF!"}},{"$f":"IF(#REF!=\"\",\"\",\"X\")","v":{"$error":"#REF!"}}]
[null,null,null,null,null,null,null,null,null,null,null,null,null,null,null,{"$f":"IF(#REF!=\"\",\"\",IF(#REF!<TODAY(),0,IF(#REF!<(TODAY()+365),1,\"X\")))","v":{"$error":"#REF!"}},{"$f":"IF(#REF!=\"\",\"\",\"X\")","v":{"$error":"#REF!"}}]
[null,null,null,null,null,null,null,null,null,null,null,null,null,null,null,{"$f":"IF(#REF!=\"\",\"\",IF(#REF!<TODAY(),0,IF(#REF!<(TODAY()+365),1,\"X\")))","v":{"$error":"#REF!"}},{"$f":"IF(#REF!=\"\",\"\",\"X\")","v":{"$error":"#REF!"}}]
[null,null,null,null,null,null,null,null,null,null,null,null,null,null,null,{"$f":"IF(#REF!=\"\",\"\",IF(#REF!<TODAY(),0,IF(#REF!<(TODAY()+365),1,\"X\")))","v":{"$error":"#REF!"}},{"$f":"IF(#REF!=\"\",\"\",\"X\")","v":{"$error":"#REF!"}}]
[null,null,null,null,null,null,null,null,null,null,null,null,null,null,null,{"$f":"IF(#REF!=\"\",\"\",IF(#REF!<TODAY(),0,IF(#REF!<(TODAY()+365),1,\"X\")))","v":{"$error":"#REF!"}},{"$f":"IF(#REF!=\"\",\"\",\"X\")","v":{"$error":"#REF!"}}]
[null,null,null,null,null,null,null,null,null,null,null,null,null,null,null,{"$f":"IF(#REF!=\"\",\"\",IF(#REF!<TODAY(),0,IF(#REF!<(TODAY()+365),1,\"X\")))","v":{"$error":"#REF!"}},{"$f":"IF(#REF!=\"\",\"\",\"X\")","v":{"$error":"#REF!"}}]
[null,null,null,null,null,null,null,null,null,null,null,null,null,null,null,{"$f":"IF(#REF!=\"\",\"\",IF(#REF!<TODAY(),0,IF(#REF!<(TODAY()+365),1,\"X\")))","v":{"$error":"#REF!"}},{"$f":"IF(#REF!=\"\",\"\",\"X\")","v":{"$error":"#REF!"}}]
[null,null,null,null,null,null,null,null,null,null,null,null,null,null,null,{"$f":"IF(#REF!=\"\",\"\",IF(#REF!<TODAY(),0,IF(#REF!<(TODAY()+365),1,\"X\")))","v":{"$error":"#REF!"}},{"$f":"IF(#REF!=\"\",\"\",\"X\")","v":{"$error":"#REF!"}}]
[null,null,null,null,null,null,null,null,null,null,null,null,null,null,null,{"$f":"IF(#REF!=\"\",\"\",IF(#REF!<TODAY(),0,IF(#REF!<(TODAY()+365),1,\"X\")))","v":{"$error":"#REF!"}},{"$f":"IF(#REF!=\"\",\"\",\"X\")","v":{"$error":"#REF!"}}]
[null,null,null,null,null,null,null,null,null,null,null,null,null,null,null,{"$f":"IF(#REF!=\"\",\"\",IF(#REF!<TODAY(),0,IF(#REF!<(TODAY()+365),1,\"X\")))","v":{"$error":"#REF!"}},{"$f":"IF(#REF!=\"\",\"\",\"X\")","v":{"$error":"#REF!"}}]
[null,null,null,null,null,null,null,null,null,null,null,null,null,null,null,{"$f":"IF(#REF!=\"\",\"\",IF(#REF!<TODAY(),0,IF(#REF!<(TODAY()+365),1,\"X\")))","v":{"$error":"#REF!"}},{"$f":"IF(#REF!=\"\",\"\",\"X\")","v":{"$error":"#REF!"}}]
[null,null,null,null,null,null,null,null,null,null,null,null,null,null,null,{"$f":"IF(#REF!=\"\",\"\",IF(#REF!<TODAY(),0,IF(#REF!<(TODAY()+365),1,\"X\")))","v":{"$error":"#REF!"}},{"$f":"IF(#REF!=\"\",\"\",\"X\")","v":{"$error":"#REF!"}}]
[null,null,null,null,null,null,null,null,null,null,null,null,null,null,null,{"$f":"IF(#REF!=\"\",\"\",IF(#REF!<TODAY(),0,IF(#REF!<(TODAY()+365),1,\"X\")))","v":{"$error":"#REF!"}},{"$f":"IF(#REF!=\"\",\"\",\"X\")","v":{"$error":"#REF!"}}]
[null,null,null,null,null,null,null,null,null,null,null,null,null,null,null,{"$f":"IF(#REF!=\"\",\"\",IF(#REF!<TODAY(),0,IF(#REF!<(TODAY()+365),1,\"X\")))","v":{"$error":"#REF!"}},{"$f":"IF(#REF!=\"\",\"\",\"X\")","v":{"$error":"#REF!"}}]
[null,null,null,null,null,null,null,null,null,null,null,null,null,null,null,{"$f":"IF(#REF!=\"\",\"\",IF(#REF!<TODAY(),0,IF(#REF!<(TODAY()+365),1,\"X\")))","v":{"$error":"#REF!"}},{"$f":"IF(#REF!=\"\",\"\",\"X\")","v":{"$error":"#REF!"}}]
[null,null,null,null,null,null,null,null,null,null,null,null,null,null,null,{"$f":"IF(#REF!=\"\",\"\",IF(#REF!<TODAY(),0,IF(#REF!<(TODAY()+365),1,\"X\")))","v":{"$error":"#REF!"}},{"$f":"IF(#REF!=\"\",\"\",\"X\")","v":{"$error":"#REF!"}}]
[null,null,null,null,null,null,null,null,null,null,null,null,null,null,null,{"$f":"IF(#REF!=\"\",\"\",IF(#REF!<TODAY(),0,IF(#REF!<(TODAY()+365),1,\"X\")))","v":{"$error":"#REF!"}},{"$f":"IF(#REF!=\"\",\"\",\"X\")","v":{"$error":"#REF!"}}]
[null,null,null,null,null,null,null,null,null,null,null,null,null,null,null,{"$f":"IF(#REF!=\"\",\"\",IF(#REF!<TODAY(),0,IF(#REF!<(TODAY()+365),1,\"X\")))","v":{"$error":"#REF!"}},{"$f":"IF(#REF!=\"\",\"\",\"X\")","v":{"$error":"#REF!"}}]
[null,null,null,null,null,null,null,null,null,null,null,null,null,null,null,{"$f":"IF(#REF!=\"\",\"\",IF(#REF!<TODAY(),0,IF(#REF!<(TODAY()+365),1,\"X\")))","v":{"$error":"#REF!"}},{"$f":"IF(#REF!=\"\",\"\",\"X\")","v":{"$error":"#REF!"}}]
[null,null,null,null,null,null,null,null,null,null,null,null,null,null,null,{"$f":"IF(#REF!=\"\",\"\",IF(#REF!<TODAY(),0,IF(#REF!<(TODAY()+365),1,\"X\")))","v":{"$error":"#REF!"}},{"$f":"IF(#REF!=\"\",\"\",\"X\")","v":{"$error":"#REF!"}}]
[null,null,null,null,null,null,null,null,null,null,null,null,null,null,null,{"$f":"IF(#REF!=\"\",\"\",IF(#REF!<TODAY(),0,IF(#REF!<(TODAY()+365),1,\"X\")))","v":{"$error":"#REF!"}},{"$f":"IF(#REF!=\"\",\"\",\"X\")","v":{"$error":"#REF!"}}]
[null,null,null,null,null,null,null,null,null,null,null,null,null,null,null,{"$f":"IF(#REF!=\"\",\"\",IF(#REF!<TODAY(),0,IF(#REF!<(TODAY()+365),1,\"X\")))","v":{"$error":"#REF!"}},{"$f":"IF(#REF!=\"\",\"\",\"X\")","v":{"$error":"#REF!"}}]
[null,null,null,null,null,null,null,null,null,null,null,null,null,null,null,{"$f":"IF(#REF!=\"\",\"\",IF(#REF!<TODAY(),0,IF(#REF!<(TODAY()+365),1,\"X\")))","v":{"$error":"#REF!"}},{"$f":"IF(#REF!=\"\",\"\",\"X\")","v":{"$error":"#REF!"}}]
[null,null,null,null,null,null,null,null,null,null,null,null,null,null,null,{"$f":"IF(#REF!=\"\",\"\",IF(#REF!<TODAY(),0,IF(#REF!<(TODAY()+365),1,\"X\")))","v":{"$error":"#REF!"}},{"$f":"IF(#REF!=\"\",\"\",\"X\")","v":{"$error":"#REF!"}}]
[null,null,null,null,null,null,null,null,null,null,null,null,null,null,null,{"$f":"IF(#REF!=\"\",\"\",IF(#REF!<TODAY(),0,IF(#REF!<(TODAY()+365),1,\"X\")))","v":{"$error":"#REF!"}},{"$f":"IF(#REF!=\"\",\"\",\"X\")","v":{"$error":"#REF!"}}]
[null,null,null,null,null,null,null,null,null,null,null,null,null,null,null,{"$f":"IF(#REF!=\"\",\"\",IF(#REF!<TODAY(),0,IF(#REF!<(TODAY()+365),1,\"X\")))","v":{"$error":"#REF!"}},{"$f":"IF(#REF!=\"\",\"\",\"X\")","v":{"$error":"#REF!"}}]
[null,null,null,null,null,null,null,null,null,null,null,null,null,null,null,{"$f":"IF(#REF!=\"\",\"\",IF(#REF!<TODAY(),0,IF(#REF!<(TODAY()+365),1,\"X\")))","v":{"$error":"#REF!"}},{"$f":"IF(#REF!=\"\",\"\",\"X\")","v":{"$error":"#REF!"}}]
[null,null,null,null,null,null,null,null,null,null,null,null,null,null,null,{"$f":"IF(#REF!=\"\",\"\",IF(#REF!<TODAY(),0,IF(#REF!<(TODAY()+365),1,\"X\")))","v":{"$error":"#REF!"}},{"$f":"IF(#REF!=\"\",\"\",\"X\")","v":{"$error":"#REF!"}}]
[null,null,null,null,null,null,null,null,null,null,null,null,null,null,null,{"$f":"IF(#REF!=\"\",\"\",IF(#REF!<TODAY(),0,IF(#REF!<(TODAY()+365),1,\"X\")))","v":{"$error":"#REF!"}},{"$f":"IF(#REF!=\"\",\"\",\"X\")","v":{"$error":"#REF!"}}]
[null,null,null,null,null,null,null,null,null,null,null,null,null,null,null,{"$f":"IF(#REF!=\"\",\"\",IF(#REF!<TODAY(),0,IF(#REF!<(TODAY()+365),1,\"X\")))","v":{"$error":"#REF!"}},{"$f":"IF(#REF!=\"\",\"\",\"X\")","v":{"$error":"#REF!"}}]
[null,null,null,null,null,null,null,null,null,null,null,null,null,null,null,{"$f":"IF(#REF!=\"\",\"\",IF(#REF!<TODAY(),0,IF(#REF!<(TODAY()+365),1,\"X\")))","v":{"$error":"#REF!"}},{"$f":"IF(#REF!=\"\",\"\",\"X\")","v":{"$error":"#REF!"}}]
[null,null,null,null,null,null,null,null,null,null,null,null,null,null,null,{"$f":"IF(#REF!=\"\",\"\",IF(#REF!<TODAY(),0,IF(#REF!<(TODAY()+365),1,\"X\")))","v":{"$error":"#REF!"}},{"$f":"IF(#REF!=\"\",\"\",\"X\")","v":{"$error":"#REF!"}}]
[null,null,null,null,null,null,null,null,null,null,null,null,null,null,null,{"$f":"IF(#REF!=\"\",\"\",IF(#REF!<TODAY(),0,IF(#REF!<(TODAY()+365),1,\"X\")))","v":{"$error":"#REF!"}},{"$f":"IF(#REF!=\"\",\"\",\"X\")","v":{"$error":"#REF!"}}]
[null,null,null,null,null,null,null,null,null,null,null,null,null,null,null,{"$f":"IF(#REF!=\"\",\"\",IF(#REF!<TODAY(),0,IF(#REF!<(TODAY()+365),1,\"X\")))","v":{"$error":"#REF!"}},{"$f":"IF(#REF!=\"\",\"\",\"X\")","v":{"$error":"#REF!"}}]
[null,null,null,null,null,null,null,null,null,null,null,null,null,null,null,{"$f":"IF(#REF!=\"\",\"\",IF(#REF!<TODAY(),0,IF(#REF!<(TODAY()+365),1,\"X\")))","v":{"$error":"#REF!"}},{"$f":"IF(#REF!=\"\",\"\",\"X\")","v":{"$error":"#REF!"}}]
[null,null,null,null,null,null,null,null,null,null,null,null,null,null,null,{"$f":"IF(#REF!=\"\",\"\",IF(#REF!<TODAY(),0,IF(#REF!<(TODAY()+365),1,\"X\")))","v":{"$error":"#REF!"}},{"$f":"IF(#REF!=\"\",\"\",\"X\")","v":{"$error":"#REF!"}}]
[null,null,null,null,null,null,null,null,null,null,null,null,null,null,null,{"$f":"IF(#REF!=\"\",\"\",IF(#REF!<TODAY(),0,IF(#REF!<(TODAY()+365),1,\"X\")))","v":{"$error":"#REF!"}},{"$f":"IF(#REF!=\"\",\"\",\"X\")","v":{"$error":"#REF!"}}]
[null,null,null,null,null,null,null,null,null,null,null,null,null,null,null,{"$f":"IF(#REF!=\"\",\"\",IF(#REF!<TODAY(),0,IF(#REF!<(TODAY()+365),1,\"X\")))","v":{"$error":"#REF!"}},{"$f":"IF(#REF!=\"\",\"\",\"X\")","v":{"$error":"#REF!"}}]
[null,null,null,null,null,null,null,null,null,null,null,null,null,null,null,{"$f":"IF(#REF!=\"\",\"\",IF(#REF!<TODAY(),0,IF(#REF!<(TODAY()+365),1,\"X\")))","v":{"$error":"#REF!"}},{"$f":"IF(#REF!=\"\",\"\",\"X\")","v":{"$error":"#REF!"}}]
[null,null,null,null,null,null,null,null,null,null,null,null,null,null,null,{"$f":"IF(#REF!=\"\",\"\",IF(#REF!<TODAY(),0,IF(#REF!<(TODAY()+365),1,\"X\")))","v":{"$error":"#REF!"}},{"$f":"IF(#REF!=\"\",\"\",\"X\")","v":{"$error":"#REF!"}}]
[null,null,null,null,null,null,null,null,null,null,null,null,null,null,null,{"$f":"IF(#REF!=\"\",\"\",IF(#REF!<TODAY(),0,IF(#REF!<(TODAY()+365),1,\"X\")))","v":{"$error":"#REF!"}},{"$f":"IF(#REF!=\"\",\"\",\"X\")","v":{"$error":"#REF!"}}]
[null,null,null,null,null,null,null,null,null,null,null,null,null,null,null,{"$f":"IF(#REF!=\"\",\"\",IF(#REF!<TODAY(),0,IF(#REF!<(TODAY()+365),1,\"X\")))","v":{"$error":"#REF!"}},{"$f":"IF(#REF!=\"\",\"\",\"X\")","v":{"$error":"#REF!"}}]
[null,null,null,null,null,null,null,null,null,null,null,null,null,null,null,{"$f":"IF(#REF!=\"\",\"\",IF(#REF!<TODAY(),0,IF(#REF!<(TODAY()+365),1,\"X\")))","v":{"$error":"#REF!"}},{"$f":"IF(#REF!=\"\",\"\",\"X\")","v":{"$error":"#REF!"}}]
[null,null,null,null,null,null,null,null,null,null,null,null,null,null,null,{"$f":"IF(#REF!=\"\",\"\",IF(#REF!<TODAY(),0,IF(#REF!<(TODAY()+365),1,\"X\")))","v":{"$error":"#REF!"}},{"$f":"IF(#REF!=\"\",\"\",\"X\")","v":{"$error":"#REF!"}}]
[null,null,null,null,null,null,null,null,null,null,null,null,null,null,null,{"$f":"IF(#REF!=\"\",\"\",IF(#REF!<TODAY(),0,IF(#REF!<(TODAY()+365),1,\"X\")))","v":{"$error":"#REF!"}},{"$f":"IF(#REF!=\"\",\"\",\"X\")","v":{"$error":"#REF!"}}]
[null,null,null,null,null,null,null,null,null,null,null,null,null,null,null,{"$f":"IF(#REF!=\"\",\"\",IF(#REF!<TODAY(),0,IF(#REF!<(TODAY()+365),1,\"X\")))","v":{"$error":"#REF!"}},{"$f":"IF(#REF!=\"\",\"\",\"X\")","v":{"$error":"#REF!"}}]
[null,null,null,null,null,null,null,null,null,null,null,null,null,null,null,{"$f":"IF(#REF!=\"\",\"\",IF(#REF!<TODAY(),0,IF(#REF!<(TODAY()+365),1,\"X\")))","v":{"$error":"#REF!"}},{"$f":"IF(#REF!=\"\",\"\",\"X\")","v":{"$error":"#REF!"}}]
[null,null,null,null,null,null,null,null,null,null,null,null,null,null,null,{"$f":"IF(#REF!=\"\",\"\",IF(#REF!<TODAY(),0,IF(#REF!<(TODAY()+365),1,\"X\")))","v":{"$error":"#REF!"}},{"$f":"IF(#REF!=\"\",\"\",\"X\")","v":{"$error":"#REF!"}}]
[null,null,null,null,null,null,null,null,null,null,null,null,null,null,null,{"$f":"IF(#REF!=\"\",\"\",IF(#REF!<TODAY(),0,IF(#REF!<(TODAY()+365),1,\"X\")))","v":{"$error":"#REF!"}},{"$f":"IF(#REF!=\"\",\"\",\"X\")","v":{"$error":"#REF!"}}]
[null,null,null,null,null,null,null,null,null,null,null,null,null,null,null,{"$f":"IF(#REF!=\"\",\"\",IF(#REF!<TODAY(),0,IF(#REF!<(TODAY()+365),1,\"X\")))","v":{"$error":"#REF!"}},{"$f":"IF(#REF!=\"\",\"\",\"X\")","v":{"$error":"#REF!"}}]
[null,null,null,null,null,null,null,null,null,null,null,null,null,null,null,{"$f":"IF(#REF!=\"\",\"\",IF(#REF!<TODAY(),0,IF(#REF!<(TODAY()+365),1,\"X\")))","v":{"$error":"#REF!"}},{"$f":"IF(#REF!=\"\",\"\",\"X\")","v":{"$error":"#REF!"}}]
[null,null,null,null,null,null,null,null,null,null,null,null,null,null,null,{"$f":"IF(#REF!=\"\",\"\",IF(#REF!<TODAY(),0,IF(#REF!<(TODAY()+365),1,\"X\")))","v":{"$error":"#REF!"}},{"$f":"IF(#REF!=\"\",\"\",\"X\")","v":{"$error":"#REF!"}}]
[null,null,null,null,null,null,null,null,null,null,null,null,null,null,null,{"$f":"IF(#REF!=\"\",\"\",IF(#REF!<TODAY(),0,IF(#REF!<(TODAY()+365),1,\"X\")))","v":{"$error":"#REF!"}},{"$f":"IF(#REF!=\"\",\"\",\"X\")","v":{"$error":"#REF!"}}]
[null,null,null,null,null,null,null,null,null,null,null,null,null,null,null,{"$f":"IF(#REF!=\"\",\"\",IF(#REF!<TODAY(),0,IF(#REF!<(TODAY()+365),1,\"X\")))","v":{"$error":"#REF!"}},{"$f":"IF(#REF!=\"\",\"\",\"X\")","v":{"$error":"#REF!"}}]
[null,null,null,null,null,null,null,null,null,null,null,null,null,null,null,{"$f":"IF(#REF!=\"\",\"\",IF(#REF!<TODAY(),0,IF(#REF!<(TODAY()+365),1,\"X\")))","v":{"$error":"#REF!"}},{"$f":"IF(#REF!=\"\",\"\",\"X\")","v":{"$error":"#REF!"}}]
[null,null,null,null,null,null,null,null,null,null,null,null,null,null,null,{"$f":"IF(#REF!=\"\",\"\",IF(#REF!<TODAY(),0,IF(#REF!<(TODAY()+365),1,\"X\")))","v":{"$error":"#REF!"}},{"$f":"IF(#REF!=\"\",\"\",\"X\")","v":{"$error":"#REF!"}}]
[null,null,null,null,null,null,null,null,null,null,null,null,null,null,null,{"$f":"IF(#REF!=\"\",\"\",IF(#REF!<TODAY(),0,IF(#REF!<(TODAY()+365),1,\"X\")))","v":{"$error":"#REF!"}},{"$f":"IF(#REF!=\"\",\"\",\"X\")","v":{"$error":"#REF!"}}]
[null,null,null,null,null,null,null,null,null,null,null,null,null,null,null,{"$f":"IF(#REF!=\"\",\"\",IF(#REF!<TODAY(),0,IF(#REF!<(TODAY()+365),1,\"X\")))","v":{"$error":"#REF!"}},{"$f":"IF(#REF!=\"\",\"\",\"X\")","v":{"$error":"#REF!"}}]
[null,null,null,null,null,null,null,null,null,null,null,null,null,null,null,{"$f":"IF(#REF!=\"\",\"\",IF(#REF!<TODAY(),0,IF(#REF!<(TODAY()+365),1,\"X\")))","v":{"$error":"#REF!"}},{"$f":"IF(#REF!=\"\",\"\",\"X\")","v":{"$error":"#REF!"}}]
[null,null,null,null,null,null,null,null,null,null,null,null,null,null,null,{"$f":"IF(#REF!=\"\",\"\",IF(#REF!<TODAY(),0,IF(#REF!<(TODAY()+365),1,\"X\")))","v":{"$error":"#REF!"}},{"$f":"IF(#REF!=\"\",\"\",\"X\")","v":{"$error":"#REF!"}}]
[null,null,null,null,null,null,null,null,null,null,null,null,null,null,null,{"$f":"IF(#REF!=\"\",\"\",IF(#REF!<TODAY(),0,IF(#REF!<(TODAY()+365),1,\"X\")))","v":{"$error":"#REF!"}},{"$f":"IF(#REF!=\"\",\"\",\"X\")","v":{"$error":"#REF!"}}]
[null,null,null,null,null,null,null,null,null,null,null,null,null,null,null,{"$f":"IF(#REF!=\"\",\"\",IF(#REF!<TODAY(),0,IF(#REF!<(TODAY()+365),1,\"X\")))","v":{"$error":"#REF!"}},{"$f":"IF(#REF!=\"\",\"\",\"X\")","v":{"$error":"#REF!"}}]
[null,null,null,null,null,null,null,null,null,null,null,null,null,null,null,{"$f":"IF(#REF!=\"\",\"\",IF(#REF!<TODAY(),0,IF(#REF!<(TODAY()+365),1,\"X\")))","v":{"$error":"#REF!"}},{"$f":"IF(#REF!=\"\",\"\",\"X\")","v":{"$error":"#REF!"}}]
[null,null,null,null,null,null,null,null,null,null,null,null,null,null,null,{"$f":"IF(#REF!=\"\",\"\",IF(#REF!<TODAY(),0,IF(#REF!<(TODAY()+365),1,\"X\")))","v":{"$error":"#REF!"}},{"$f":"IF(#REF!=\"\",\"\",\"X\")","v":{"$error":"#REF!"}}]
[null,null,null,null,null,null,null,null,null,null,null,null,null,null,null,{"$f":"IF(#REF!=\"\",\"\",IF(#REF!<TODAY(),0,IF(#REF!<(TODAY()+365),1,\"X\")))","v":{"$error":"#REF!"}},{"$f":"IF(#REF!=\"\",\"\",\"X\")","v":{"$error":"#REF!"}}]
[null,null,null,null,null,null,null,null,null,null,null,null,null,null,null,{"$f":"IF(#REF!=\"\",\"\",IF(#REF!<TODAY(),0,IF(#REF!<(TODAY()+365),1,\"X\")))","v":{"$error":"#REF!"}},{"$f":"IF(#REF!=\"\",\"\",\"X\")","v":{"$error":"#REF!"}}]
[null,null,null,null,null,null,null,null,null,null,null,null,null,null,null,{"$f":"IF(#REF!=\"\",\"\",IF(#REF!<TODAY(),0,IF(#REF!<(TODAY()+365),1,\"X\")))","v":{"$error":"#REF!"}},{"$f":"IF(#REF!=\"\",\"\",\"X\")","v":{"$error":"#REF!"}}]
[null,null,null,null,null,null,null,null,null,null,null,null,null,null,null,{"$f":"IF(#REF!=\"\",\"\",IF(#REF!<TODAY(),0,IF(#REF!<(TODAY()+365),1,\"X\")))","v":{"$error":"#REF!"}},{"$f":"IF(#REF!=\"\",\"\",\"X\")","v":{"$error":"#REF!"}}]
[null,null,null,null,null,null,null,null,null,null,null,null,null,null,null,{"$f":"IF(#REF!=\"\",\"\",IF(#REF!<TODAY(),0,IF(#REF!<(TODAY()+365),1,\"X\")))","v":{"$error":"#REF!"}},{"$f":"IF(#REF!=\"\",\"\",\"X\")","v":{"$error":"#REF!"}}]
[null,null,null,null,null,null,null,null,null,null,null,null,null,null,null,{"$f":"IF(#REF!=\"\",\"\",IF(#REF!<TODAY(),0,IF(#REF!<(TODAY()+365),1,\"X\")))","v":{"$error":"#REF!"}},{"$f":"IF(#REF!=\"\",\"\",\"X\")","v":{"$error":"#REF!"}}]
[null,null,null,null,null,null,null,null,null,null,null,null,null,null,null,{"$f":"IF(#REF!=\"\",\"\",IF(#REF!<TODAY(),0,IF(#REF!<(TODAY()+365),1,\"X\")))","v":{"$error":"#REF!"}},{"$f":"IF(#REF!=\"\",\"\",\"X\")","v":{"$error":"#REF!"}}]
[null,null,null,null,null,null,null,null,null,null,null,null,null,null,null,{"$f":"IF(#REF!=\"\",\"\",IF(#REF!<TODAY(),0,IF(#REF!<(TODAY()+365),1,\"X\")))","v":{"$error":"#REF!"}},{"$f":"IF(#REF!=\"\",\"\",\"X\")","v":{"$error":"#REF!"}}]
[null,null,null,null,null,null,null,null,null,null,null,null,null,null,null,{"$f":"IF(#REF!=\"\",\"\",IF(#REF!<TODAY(),0,IF(#REF!<(TODAY()+365),1,\"X\")))","v":{"$error":"#REF!"}},{"$f":"IF(#REF!=\"\",\"\",\"X\")","v":{"$error":"#REF!"}}]
[null,null,null,null,null,null,null,null,null,null,null,null,null,null,null,{"$f":"IF(#REF!=\"\",\"\",IF(#REF!<TODAY(),0,IF(#REF!<(TODAY()+365),1,\"X\")))","v":{"$error":"#REF!"}},{"$f":"IF(#REF!=\"\",\"\",\"X\")","v":{"$error":"#REF!"}}]
[null,null,null,null,null,null,null,null,null,null,null,null,null,null,null,{"$f":"IF(#REF!=\"\",\"\",IF(#REF!<TODAY(),0,IF(#REF!<(TODAY()+365),1,\"X\")))","v":{"$error":"#REF!"}},{"$f":"IF(#REF!=\"\",\"\",\"X\")","v":{"$error":"#REF!"}}]
[null,null,null,null,null,null,null,null,null,null,null,null,null,null,null,{"$f":"IF(#REF!=\"\",\"\",IF(#REF!<TODAY(),0,IF(#REF!<(TODAY()+365),1,\"X\")))","v":{"$error":"#REF!"}},{"$f":"IF(#REF!=\"\",\"\",\"X\")","v":{"$error":"#REF!"}}]
[null,null,null,null,null,null,null,null,null,null,null,null,null,null,null,{"$f":"IF(#REF!=\"\",\"\",IF(#REF!<TODAY(),0,IF(#REF!<(TODAY()+365),1,\"X\")))","v":{"$error":"#REF!"}},{"$f":"IF(#REF!=\"\",\"\",\"X\")","v":{"$error":"#REF!"}}]
[null,null,null,null,null,null,null,null,null,null,null,null,null,null,null,{"$f":"IF(#REF!=\"\",\"\",IF(#REF!<TODAY(),0,IF(#REF!<(TODAY()+365),1,\"X\")))","v":{"$error":"#REF!"}},{"$f":"IF(#REF!=\"\",\"\",\"X\")","v":{"$error":"#REF!"}}]
[null,null,null,null,null,null,null,null,null,null,null,null,null,null,null,{"$f":"IF(#REF!=\"\",\"\",IF(#REF!<TODAY(),0,IF(#REF!<(TODAY()+365),1,\"X\")))","v":{"$error":"#REF!"}},{"$f":"IF(#REF!=\"\",\"\",\"X\")","v":{"$error":"#REF!"}}]
[null,null,null,null,null,null,null,null,null,null,null,null,null,null,null,{"$f":"IF(#REF!=\"\",\"\",IF(#REF!<TODAY(),0,IF(#REF!<(TODAY()+365),1,\"X\")))","v":{"$error":"#REF!"}},{"$f":"IF(#REF!=\"\",\"\",\"X\")","v":{"$error":"#REF!"}}]
[null,null,null,null,null,null,null,null,null,null,null,null,null,null,null,{"$f":"IF(#REF!=\"\",\"\",IF(#REF!<TODAY(),0,IF(#REF!<(TODAY()+365),1,\"X\")))","v":{"$error":"#REF!"}},{"$f":"IF(#REF!=\"\",\"\",\"X\")","v":{"$error":"#REF!"}}]
[null,null,null,null,null,null,null,null,null,null,null,null,null,null,null,{"$f":"IF(#REF!=\"\",\"\",IF(#REF!<TODAY(),0,IF(#REF!<(TODAY()+365),1,\"X\")))","v":{"$error":"#REF!"}},{"$f":"IF(#REF!=\"\",\"\",\"X\")","v":{"$error":"#REF!"}}]
[null,null,null,null,null,null,null,null,null,null,null,null,null,null,null,{"$f":"IF(#REF!=\"\",\"\",IF(#REF!<TODAY(),0,IF(#REF!<(TODAY()+365),1,\"X\")))","v":{"$error":"#REF!"}},{"$f":"IF(#REF!=\"\",\"\",\"X\")","v":{"$error":"#REF!"}}]
[null,null,null,null,null,null,null,null,null,null,null,null,null,null,null,{"$f":"IF(#REF!=\"\",\"\",IF(#REF!<TODAY(),0,IF(#REF!<(TODAY()+365),1,\"X\")))","v":{"$error":"#REF!"}},{"$f":"IF(#REF!=\"\",\"\",\"X\")","v":{"$error":"#REF!"}}]
[null,null,null,null,null,null,null,null,null,null,null,null,null,null,null,{"$f":"IF(#REF!=\"\",\"\",IF(#REF!<TODAY(),0,IF(#REF!<(TODAY()+365),1,\"X\")))","v":{"$error":"#REF!"}},{"$f":"IF(#REF!=\"\",\"\",\"X\")","v":{"$error":"#REF!"}}]
[null,null,null,null,null,null,null,null,null,null,null,null,null,null,null,{"$f":"IF(#REF!=\"\",\"\",IF(#REF!<TODAY(),0,IF(#REF!<(TODAY()+365),1,\"X\")))","v":{"$error":"#REF!"}},{"$f":"IF(#REF!=\"\",\"\",\"X\")","v":{"$error":"#REF!"}}]
[null,null,null,null,null,null,null,null,null,null,null,null,null,null,null,{"$f":"IF(#REF!=\"\",\"\",IF(#REF!<TODAY(),0,IF(#REF!<(TODAY()+365),1,\"X\")))","v":{"$error":"#REF!"}},{"$f":"IF(#REF!=\"\",\"\",\"X\")","v":{"$error":"#REF!"}}]
[null,null,null,null,null,null,null,null,null,null,null,null,null,null,null,{"$f":"IF(#REF!=\"\",\"\",IF(#REF!<TODAY(),0,IF(#REF!<(TODAY()+365),1,\"X\")))","v":{"$error":"#REF!"}},{"$f":"IF(#REF!=\"\",\"\",\"X\")","v":{"$error":"#REF!"}}]
[null,null,null,null,null,null,null,null,null,null,null,null,null,null,null,{"$f":"IF(#REF!=\"\",\"\",IF(#REF!<TODAY(),0,IF(#REF!<(TODAY()+365),1,\"X\")))","v":{"$error":"#REF!"}},{"$f":"IF(#REF!=\"\",\"\",\"X\")","v":{"$error":"#REF!"}}]
[null,null,null,null,null,null,null,null,null,null,null,null,null,null,null,{"$f":"IF(#REF!=\"\",\"\",IF(#REF!<TODAY(),0,IF(#REF!<(TODAY()+365),1,\"X\")))","v":{"$error":"#REF!"}},{"$f":"IF(#REF!=\"\",\"\",\"X\")","v":{"$error":"#REF!"}}]
[null,null,null,null,null,null,null,null,null,null,null,null,null,null,null,{"$f":"IF(#REF!=\"\",\"\",IF(#REF!<TODAY(),0,IF(#REF!<(TODAY()+365),1,\"X\")))","v":{"$error":"#REF!"}},{"$f":"IF(#REF!=\"\",\"\",\"X\")","v":{"$error":"#REF!"}}]
[null,null,null,null,null,null,null,null,null,null,null,null,null,null,null,{"$f":"IF(#REF!=\"\",\"\",IF(#REF!<TODAY(),0,IF(#REF!<(TODAY()+365),1,\"X\")))","v":{"$error":"#REF!"}},{"$f":"IF(#REF!=\"\",\"\",\"X\")","v":{"$error":"#REF!"}}]
[null,null,null,null,null,null,null,null,null,null,null,null,null,null,null,{"$f":"IF(#REF!=\"\",\"\",IF(#REF!<TODAY(),0,IF(#REF!<(TODAY()+365),1,\"X\")))","v":{"$error":"#REF!"}},{"$f":"IF(#REF!=\"\",\"\",\"X\")","v":{"$error":"#REF!"}}]
[null,null,null,null,null,null,null,null,null,null,null,null,null,null,null,{"$f":"IF(#REF!=\"\",\"\",IF(#REF!<TODAY(),0,IF(#REF!<(TODAY()+365),1,\"X\")))","v":{"$error":"#REF!"}},{"$f":"IF(#REF!=\"\",\"\",\"X\")","v":{"$error":"#REF!"}}]
[null,null,null,null,null,null,null,null,null,null,null,null,null,null,null,{"$f":"IF(#REF!=\"\",\"\",IF(#REF!<TODAY(),0,IF(#REF!<(TODAY()+365),1,\"X\")))","v":{"$error":"#REF!"}},{"$f":"IF(#REF!=\"\",\"\",\"X\")","v":{"$error":"#REF!"}}]
[null,null,null,null,null,null,null,null,null,null,null,null,null,null,null,{"$f":"IF(#REF!=\"\",\"\",IF(#REF!<TODAY(),0,IF(#REF!<(TODAY()+365),1,\"X\")))","v":{"$error":"#REF!"}},{"$f":"IF(#REF!=\"\",\"\",\"X\")","v":{"$error":"#REF!"}}]
[null,null,null,null,null,null,null,null,null,null,null,null,null,null,null,{"$f":"IF(#REF!=\"\",\"\",IF(#REF!<TODAY(),0,IF(#REF!<(TODAY()+365),1,\"X\")))","v":{"$error":"#REF!"}},{"$f":"IF(#REF!=\"\",\"\",\"X\")","v":{"$error":"#REF!"}}]
[null,null,null,null,null,null,null,null,null,null,null,null,null,null,null,{"$f":"IF(#REF!=\"\",\"\",IF(#REF!<TODAY(),0,IF(#REF!<(TODAY()+365),1,\"X\")))","v":{"$error":"#REF!"}},{"$f":"IF(#REF!=\"\",\"\",\"X\")","v":{"$error":"#REF!"}}]
[null,null,null,null,null,null,null,null,null,null,null,null,null,null,null,{"$f":"IF(#REF!=\"\",\"\",IF(#REF!<TODAY(),0,IF(#REF!<(TODAY()+365),1,\"X\")))","v":{"$error":"#REF!"}},{"$f":"IF(#REF!=\"\",\"\",\"X\")","v":{"$error":"#REF!"}}]
[null,null,null,null,null,null,null,null,null,null,null,null,null,null,null,{"$f":"IF(#REF!=\"\",\"\",IF(#REF!<TODAY(),0,IF(#REF!<(TODAY()+365),1,\"X\")))","v":{"$error":"#REF!"}},{"$f":"IF(#REF!=\"\",\"\",\"X\")","v":{"$error":"#REF!"}}]
[null,null,null,null,null,null,null,null,null,null,null,null,null,null,null,{"$f":"IF(#REF!=\"\",\"\",IF(#REF!<TODAY(),0,IF(#REF!<(TODAY()+365),1,\"X\")))","v":{"$error":"#REF!"}},{"$f":"IF(#REF!=\"\",\"\",\"X\")","v":{"$error":"#REF!"}}]
[null,null,null,null,null,null,null,null,null,null,null,null,null,null,null,{"$f":"IF(#REF!=\"\",\"\",IF(#REF!<TODAY(),0,IF(#REF!<(TODAY()+365),1,\"X\")))","v":{"$error":"#REF!"}},{"$f":"IF(#REF!=\"\",\"\",\"X\")","v":{"$error":"#REF!"}}]
[null,null,null,null,null,null,null,null,null,null,null,null,null,null,null,{"$f":"IF(#REF!=\"\",\"\",IF(#REF!<TODAY(),0,IF(#REF!<(TODAY()+365),1,\"X\")))","v":{"$error":"#REF!"}},{"$f":"IF(#REF!=\"\",\"\",\"X\")","v":{"$error":"#REF!"}}]
[null,null,null,null,null,null,null,null,null,null,null,null,null,null,null,{"$f":"IF(#REF!=\"\",\"\",IF(#REF!<TODAY(),0,IF(#REF!<(TODAY()+365),1,\"X\")))","v":{"$error":"#REF!"}},{"$f":"IF(#REF!=\"\",\"\",\"X\")","v":{"$error":"#REF!"}}]
[null,null,null,null,null,null,null,null,null,null,null,null,null,null,null,{"$f":"IF(#REF!=\"\",\"\",IF(#REF!<TODAY(),0,IF(#REF!<(TODAY()+365),1,\"X\")))","v":{"$error":"#REF!"}},{"$f":"IF(#REF!=\"\",\"\",\"X\")","v":{"$error":"#REF!"}}]
[null,null,null,null,null,null,null,null,null,null,null,null,null,null,null,{"$f":"IF(#REF!=\"\",\"\",IF(#REF!<TODAY(),0,IF(#REF!<(TODAY()+365),1,\"X\")))","v":{"$error":"#REF!"}},{"$f":"IF(#REF!=\"\",\"\",\"X\")","v":{"$error":"#REF!"}}]
[null,null,null,null,null,null,null,null,null,null,null,null,null,null,null,{"$f":"IF(#REF!=\"\",\"\",IF(#REF!<TODAY(),0,IF(#REF!<(TODAY()+365),1,\"X\")))","v":{"$error":"#REF!"}},{"$f":"IF(#REF!=\"\",\"\",\"X\")","v":{"$error":"#REF!"}}]
[null,null,null,null,null,null,null,null,null,null,null,null,null,null,null,{"$f":"IF(#REF!=\"\",\"\",IF(#REF!<TODAY(),0,IF(#REF!<(TODAY()+365),1,\"X\")))","v":{"$error":"#REF!"}},{"$f":"IF(#REF!=\"\",\"\",\"X\")","v":{"$error":"#REF!"}}]
[null,null,null,null,null,null,null,null,null,null,null,null,null,null,null,{"$f":"IF(#REF!=\"\",\"\",IF(#REF!<TODAY(),0,IF(#REF!<(TODAY()+365),1,\"X\")))","v":{"$error":"#REF!"}},{"$f":"IF(#REF!=\"\",\"\",\"X\")","v":{"$error":"#REF!"}}]
[null,null,null,null,null,null,null,null,null,null,null,null,null,null,null,{"$f":"IF(#REF!=\"\",\"\",IF(#REF!<TODAY(),0,IF(#REF!<(TODAY()+365),1,\"X\")))","v":{"$error":"#REF!"}},{"$f":"IF(#REF!=\"\",\"\",\"X\")","v":{"$error":"#REF!"}}]
[null,null,null,null,null,null,null,null,null,null,null,null,null,null,null,{"$f":"IF(#REF!=\"\",\"\",IF(#REF!<TODAY(),0,IF(#REF!<(TODAY()+365),1,\"X\")))","v":{"$error":"#REF!"}},{"$f":"IF(#REF!=\"\",\"\",\"X\")","v":{"$error":"#REF!"}}]
[null,null,null,null,null,null,null,null,null,null,null,null,null,null,null,{"$f":"IF(#REF!=\"\",\"\",IF(#REF!<TODAY(),0,IF(#REF!<(TODAY()+365),1,\"X\")))","v":{"$error":"#REF!"}},{"$f":"IF(#REF!=\"\",\"\",\"X\")","v":{"$error":"#REF!"}}]
[null,null,null,null,null,null,null,null,null,null,null,null,null,null,null,{"$f":"IF(#REF!=\"\",\"\",IF(#REF!<TODAY(),0,IF(#REF!<(TODAY()+365),1,\"X\")))","v":{"$error":"#REF!"}},{"$f":"IF(#REF!=\"\",\"\",\"X\")","v":{"$error":"#REF!"}}]
[null,null,null,null,null,null,null,null,null,null,null,null,null,null,null,{"$f":"IF(#REF!=\"\",\"\",IF(#REF!<TODAY(),0,IF(#REF!<(TODAY()+365),1,\"X\")))","v":{"$error":"#REF!"}},{"$f":"IF(#REF!=\"\",\"\",\"X\")","v":{"$error":"#REF!"}}]
[null,null,null,null,null,null,null,null,null,null,null,null,null,null,null,{"$f":"IF(#REF!=\"\",\"\",IF(#REF!<TODAY(),0,IF(#REF!<(TODAY()+365),1,\"X\")))","v":{"$error":"#REF!"}},{"$f":"IF(#REF!=\"\",\"\",\"X\")","v":{"$error":"#REF!"}}]
[null,null,null,null,null,null,null,null,null,null,null,null,null,null,null,{"$f":"IF(#REF!=\"\",\"\",IF(#REF!<TODAY(),0,IF(#REF!<(TODAY()+365),1,\"X\")))","v":{"$error":"#REF!"}},{"$f":"IF(#REF!=\"\",\"\",\"X\")","v":{"$error":"#REF!"}}]
[null,null,null,null,null,null,null,null,null,null,null,null,null,null,null,{"$f":"IF(#REF!=\"\",\"\",IF(#REF!<TODAY(),0,IF(#REF!<(TODAY()+365),1,\"X\")))","v":{"$error":"#REF!"}},{"$f":"IF(#REF!=\"\",\"\",\"X\")","v":{"$error":"#REF!"}}]
[null,null,null,null,null,null,null,null,null,null,null,null,null,null,null,{"$f":"IF(#REF!=\"\",\"\",IF(#REF!<TODAY(),0,IF(#REF!<(TODAY()+365),1,\"X\")))","v":{"$error":"#REF!"}},{"$f":"IF(#REF!=\"\",\"\",\"X\")","v":{"$error":"#REF!"}}]
[null,null,null,null,null,null,null,null,null,null,null,null,null,null,null,{"$f":"IF(#REF!=\"\",\"\",IF(#REF!<TODAY(),0,IF(#REF!<(TODAY()+365),1,\"X\")))","v":{"$error":"#REF!"}},{"$f":"IF(#REF!=\"\",\"\",\"X\")","v":{"$error":"#REF!"}}]
[null,null,null,null,null,null,null,null,null,null,null,null,null,null,null,{"$f":"IF(#REF!=\"\",\"\",IF(#REF!<TODAY(),0,IF(#REF!<(TODAY()+365),1,\"X\")))","v":{"$error":"#REF!"}},{"$f":"IF(#REF!=\"\",\"\",\"X\")","v":{"$error":"#REF!"}}]
[null,null,null,null,null,null,null,null,null,null,null,null,null,null,null,{"$f":"IF(#REF!=\"\",\"\",IF(#REF!<TODAY(),0,IF(#REF!<(TODAY()+365),1,\"X\")))","v":{"$error":"#REF!"}},{"$f":"IF(#REF!=\"\",\"\",\"X\")","v":{"$error":"#REF!"}}]
[null,null,null,null,null,null,null,null,null,null,null,null,null,null,null,{"$f":"IF(#REF!=\"\",\"\",IF(#REF!<TODAY(),0,IF(#REF!<(TODAY()+365),1,\"X\")))","v":{"$error":"#REF!"}},{"$f":"IF(#REF!=\"\",\"\",\"X\")","v":{"$error":"#REF!"}}]
[null,null,null,null,null,null,null,null,null,null,null,null,null,null,null,{"$f":"IF(#REF!=\"\",\"\",IF(#REF!<TODAY(),0,IF(#REF!<(TODAY()+365),1,\"X\")))","v":{"$error":"#REF!"}},{"$f":"IF(#REF!=\"\",\"\",\"X\")","v":{"$error":"#REF!"}}]
[null,null,null,null,null,null,null,null,null,null,null,null,null,null,null,{"$f":"IF(#REF!=\"\",\"\",IF(#REF!<TODAY(),0,IF(#REF!<(TODAY()+365),1,\"X\")))","v":{"$error":"#REF!"}},{"$f":"IF(#REF!=\"\",\"\",\"X\")","v":{"$error":"#REF!"}}]
[null,null,null,null,null,null,null,null,null,null,null,null,null,null,null,{"$f":"IF(#REF!=\"\",\"\",IF(#REF!<TODAY(),0,IF(#REF!<(TODAY()+365),1,\"X\")))","v":{"$error":"#REF!"}},{"$f":"IF(#REF!=\"\",\"\",\"X\")","v":{"$error":"#REF!"}}]
[null,null,null,null,null,null,null,null,null,null,null,null,null,null,null,{"$f":"IF(#REF!=\"\",\"\",IF(#REF!<TODAY(),0,IF(#REF!<(TODAY()+365),1,\"X\")))","v":{"$error":"#REF!"}},{"$f":"IF(#REF!=\"\",\"\",\"X\")","v":{"$error":"#REF!"}}]
[null,null,null,null,null,null,null,null,null,null,null,null,null,null,null,{"$f":"IF(#REF!=\"\",\"\",IF(#REF!<TODAY(),0,IF(#REF!<(TODAY()+365),1,\"X\")))","v":{"$error":"#REF!"}},{"$f":"IF(#REF!=\"\",\"\",\"X\")","v":{"$error":"#REF!"}}]
[null,null,null,null,null,null,null,null,null,null,null,null,null,null,null,{"$f":"IF(#REF!=\"\",\"\",IF(#REF!<TODAY(),0,IF(#REF!<(TODAY()+365),1,\"X\")))","v":{"$error":"#REF!"}},{"$f":"IF(#REF!=\"\",\"\",\"X\")","v":{"$error":"#REF!"}}]
[null,null,null,null,null,null,null,null,null,null,null,null,null,null,null,{"$f":"IF(#REF!=\"\",\"\",IF(#REF!<TODAY(),0,IF(#REF!<(TODAY()+365),1,\"X\")))","v":{"$error":"#REF!"}},{"$f":"IF(#REF!=\"\",\"\",\"X\")","v":{"$error":"#REF!"}}]
[null,null,null,null,null,null,null,null,null,null,null,null,null,null,null,{"$f":"IF(#REF!=\"\",\"\",IF(#REF!<TODAY(),0,IF(#REF!<(TODAY()+365),1,\"X\")))","v":{"$error":"#REF!"}},{"$f":"IF(#REF!=\"\",\"\",\"X\")","v":{"$error":"#REF!"}}]
[null,null,null,null,null,null,null,null,null,null,null,null,null,null,null,{"$f":"IF(#REF!=\"\",\"\",IF(#REF!<TODAY(),0,IF(#REF!<(TODAY()+365),1,\"X\")))","v":{"$error":"#REF!"}},{"$f":"IF(#REF!=\"\",\"\",\"X\")","v":{"$error":"#REF!"}}]
[null,null,null,null,null,null,null,null,null,null,null,null,null,null,null,{"$f":"IF(#REF!=\"\",\"\",IF(#REF!<TODAY(),0,IF(#REF!<(TODAY()+365),1,\"X\")))","v":{"$error":"#REF!"}},{"$f":"IF(#REF!=\"\",\"\",\"X\")","v":{"$error":"#REF!"}}]
[null,null,null,null,null,null,null,null,null,null,null,null,null,null,null,{"$f":"IF(#REF!=\"\",\"\",IF(#REF!<TODAY(),0,IF(#REF!<(TODAY()+365),1,\"X\")))","v":{"$error":"#REF!"}},{"$f":"IF(#REF!=\"\",\"\",\"X\")","v":{"$error":"#REF!"}}]
[null,null,null,null,null,null,null,null,null,null,null,null,null,null,null,{"$f":"IF(#REF!=\"\",\"\",IF(#REF!<TODAY(),0,IF(#REF!<(TODAY()+365),1,\"X\")))","v":{"$error":"#REF!"}},{"$f":"IF(#REF!=\"\",\"\",\"X\")","v":{"$error":"#REF!"}}]
[null,null,null,null,null,null,null,null,null,null,null,null,null,null,null,{"$f":"IF(#REF!=\"\",\"\",IF(#REF!<TODAY(),0,IF(#REF!<(TODAY()+365),1,\"X\")))","v":{"$error":"#REF!"}},{"$f":"IF(#REF!=\"\",\"\",\"X\")","v":{"$error":"#REF!"}}]
[null,null,null,null,null,null,null,null,null,null,null,null,null,null,null,{"$f":"IF(#REF!=\"\",\"\",IF(#REF!<TODAY(),0,IF(#REF!<(TODAY()+365),1,\"X\")))","v":{"$error":"#REF!"}},{"$f":"IF(#REF!=\"\",\"\",\"X\")","v":{"$error":"#REF!"}}]
[null,null,null,null,null,null,null,null,null,null,null,null,null,null,null,{"$f":"IF(#REF!=\"\",\"\",IF(#REF!<TODAY(),0,IF(#REF!<(TODAY()+365),1,\"X\")))","v":{"$error":"#REF!"}},{"$f":"IF(#REF!=\"\",\"\",\"X\")","v":{"$error":"#REF!"}}]
[null,null,null,null,null,null,null,null,null,null,null,null,null,null,null,{"$f":"IF(#REF!=\"\",\"\",IF(#REF!<TODAY(),0,IF(#REF!<(TODAY()+365),1,\"X\")))","v":{"$error":"#REF!"}},{"$f":"IF(#REF!=\"\",\"\",\"X\")","v":{"$error":"#REF!"}}]
[null,null,null,null,null,null,null,null,null,null,null,null,null,null,null,{"$f":"IF(#REF!=\"\",\"\",IF(#REF!<TODAY(),0,IF(#REF!<(TODAY()+365),1,\"X\")))","v":{"$error":"#REF!"}},{"$f":"IF(#REF!=\"\",\"\",\"X\")","v":{"$error":"#REF!"}}]
[null,null,null,null,null,null,null,null,null,null,null,null,null,null,null,{"$f":"IF(#REF!=\"\",\"\",IF(#REF!<TODAY(),0,IF(#REF!<(TODAY()+365),1,\"X\")))","v":{"$error":"#REF!"}},{"$f":"IF(#REF!=\"\",\"\",\"X\")","v":{"$error":"#REF!"}}]
[null,null,null,null,null,null,null,null,null,null,null,null,null,null,null,{"$f":"IF(#REF!=\"\",\"\",IF(#REF!<TODAY(),0,IF(#REF!<(TODAY()+365),1,\"X\")))","v":{"$error":"#REF!"}},{"$f":"IF(#REF!=\"\",\"\",\"X\")","v":{"$error":"#REF!"}}]
[null,null,null,null,null,null,null,null,null,null,null,null,null,null,null,{"$f":"IF(#REF!=\"\",\"\",IF(#REF!<TODAY(),0,IF(#REF!<(TODAY()+365),1,\"X\")))","v":{"$error":"#REF!"}},{"$f":"IF(#REF!=\"\",\"\",\"X\")","v":{"$error":"#REF!"}}]
[null,null,null,null,null,null,null,null,null,null,null,null,null,null,null,{"$f":"IF(#REF!=\"\",\"\",IF(#REF!<TODAY(),0,IF(#REF!<(TODAY()+365),1,\"X\")))","v":{"$error":"#REF!"}},{"$f":"IF(#REF!=\"\",\"\",\"X\")","v":{"$error":"#REF!"}}]
[null,null,null,null,null,null,null,null,null,null,null,null,null,null,null,{"$f":"IF(#REF!=\"\",\"\",IF(#REF!<TODAY(),0,IF(#REF!<(TODAY()+365),1,\"X\")))","v":{"$error":"#REF!"}},{"$f":"IF(#REF!=\"\",\"\",\"X\")","v":{"$error":"#REF!"}}]
[null,null,null,null,null,null,null,null,null,null,null,null,null,null,null,{"$f":"IF(#REF!=\"\",\"\",IF(#REF!<TODAY(),0,IF(#REF!<(TODAY()+365),1,\"X\")))","v":{"$error":"#REF!"}},{"$f":"IF(#REF!=\"\",\"\",\"X\")","v":{"$error":"#REF!"}}]
[null,null,null,null,null,null,null,null,null,null,null,null,null,null,null,{"$f":"IF(#REF!=\"\",\"\",IF(#REF!<TODAY(),0,IF(#REF!<(TODAY()+365),1,\"X\")))","v":{"$error":"#REF!"}},{"$f":"IF(#REF!=\"\",\"\",\"X\")","v":{"$error":"#REF!"}}]
[null,null,null,null,null,null,null,null,null,null,null,null,null,null,null,{"$f":"IF(#REF!=\"\",\"\",IF(#REF!<TODAY(),0,IF(#REF!<(TODAY()+365),1,\"X\")))","v":{"$error":"#REF!"}},{"$f":"IF(#REF!=\"\",\"\",\"X\")","v":{"$error":"#REF!"}}]
[null,null,null,null,null,null,null,null,null,null,null,null,null,null,null,{"$f":"IF(#REF!=\"\",\"\",IF(#REF!<TODAY(),0,IF(#REF!<(TODAY()+365),1,\"X\")))","v":{"$error":"#REF!"}},{"$f":"IF(#REF!=\"\",\"\",\"X\")","v":{"$error":"#REF!"}}]
[null,null,null,null,null,null,null,null,null,null,null,null,null,null,null,{"$f":"IF(#REF!=\"\",\"\",IF(#REF!<TODAY(),0,IF(#REF!<(TODAY()+365),1,\"X\")))","v":{"$error":"#REF!"}},{"$f":"IF(#REF!=\"\",\"\",\"X\")","v":{"$error":"#REF!"}}]
[null,null,null,null,null,null,null,null,null,null,null,null,null,null,null,{"$f":"IF(#REF!=\"\",\"\",IF(#REF!<TODAY(),0,IF(#REF!<(TODAY()+365),1,\"X\")))","v":{"$error":"#REF!"}},{"$f":"IF(#REF!=\"\",\"\",\"X\")","v":{"$error":"#REF!"}}]
[null,null,null,null,null,null,null,null,null,null,null,null,null,null,null,{"$f":"IF(#REF!=\"\",\"\",IF(#REF!<TODAY(),0,IF(#REF!<(TODAY()+365),1,\"X\")))","v":{"$error":"#REF!"}},{"$f":"IF(#REF!=\"\",\"\",\"X\")","v":{"$error":"#REF!"}}]
[null,null,null,null,null,null,null,null,null,null,null,null,null,null,null,{"$f":"IF(#REF!=\"\",\"\",IF(#REF!<TODAY(),0,IF(#REF!<(TODAY()+365),1,\"X\")))","v":{"$error":"#REF!"}},{"$f":"IF(#REF!=\"\",\"\",\"X\")","v":{"$error":"#REF!"}}]
[null,null,null,null,null,null,null,null,null,null,null,null,null,null,null,{"$f":"IF(#REF!=\"\",\"\",IF(#REF!<TODAY(),0,IF(#REF!<(TODAY()+365),1,\"X\")))","v":{"$error":"#REF!"}},{"$f":"IF(#REF!=\"\",\"\",\"X\")","v":{"$error":"#REF!"}}]
[null,null,null,null,null,null,null,null,null,null,null,null,null,null,null,{"$f":"IF(#REF!=\"\",\"\",IF(#REF!<TODAY(),0,IF(#REF!<(TODAY()+365),1,\"X\")))","v":{"$error":"#REF!"}},{"$f":"IF(#REF!=\"\",\"\",\"X\")","v":{"$error":"#REF!"}}]
[null,null,null,null,null,null,null,null,null,null,null,null,null,null,null,{"$f":"IF(#REF!=\"\",\"\",IF(#REF!<TODAY(),0,IF(#REF!<(TODAY()+365),1,\"X\")))","v":{"$error":"#REF!"}},{"$f":"IF(#REF!=\"\",\"\",\"X\")","v":{"$error":"#REF!"}}]
[null,null,null,null,null,null,null,null,null,null,null,null,null,null,null,{"$f":"IF(#REF!=\"\",\"\",IF(#REF!<TODAY(),0,IF(#REF!<(TODAY()+365),1,\"X\")))","v":{"$error":"#REF!"}},{"$f":"IF(#REF!=\"\",\"\",\"X\")","v":{"$error":"#REF!"}}]
[null,null,null,null,null,null,null,null,null,null,null,null,null,null,null,{"$f":"IF(#REF!=\"\",\"\",IF(#REF!<TODAY(),0,IF(#REF!<(TODAY()+365),1,\"X\")))","v":{"$error":"#REF!"}},{"$f":"IF(#REF!=\"\",\"\",\"X\")","v":{"$error":"#REF!"}}]
[null,null,null,null,null,null,null,null,null,null,null,null,null,null,null,{"$f":"IF(#REF!=\"\",\"\",IF(#REF!<TODAY(),0,IF(#REF!<(TODAY()+365),1,\"X\")))","v":{"$error":"#REF!"}},{"$f":"IF(#REF!=\"\",\"\",\"X\")","v":{"$error":"#REF!"}}]
[null,null,null,null,null,null,null,null,null,null,null,null,null,null,null,{"$f":"IF(#REF!=\"\",\"\",IF(#REF!<TODAY(),0,IF(#REF!<(TODAY()+365),1,\"X\")))","v":{"$error":"#REF!"}},{"$f":"IF(#REF!=\"\",\"\",\"X\")","v":{"$error":"#REF!"}}]
[null,null,null,null,null,null,null,null,null,null,null,null,null,null,null,{"$f":"IF(#REF!=\"\",\"\",IF(#REF!<TODAY(),0,IF(#REF!<(TODAY()+365),1,\"X\")))","v":{"$error":"#REF!"}},{"$f":"IF(#REF!=\"\",\"\",\"X\")","v":{"$error":"#REF!"}}]
[null,null,null,null,null,null,null,null,null,null,null,null,null,null,null,{"$f":"IF(#REF!=\"\",\"\",IF(#REF!<TODAY(),0,IF(#REF!<(TODAY()+365),1,\"X\")))","v":{"$error":"#REF!"}},{"$f":"IF(#REF!=\"\",\"\",\"X\")","v":{"$error":"#REF!"}}]
[null,null,null,null,null,null,null,null,null,null,null,null,null,null,null,{"$f":"IF(#REF!=\"\",\"\",IF(#REF!<TODAY(),0,IF(#REF!<(TODAY()+365),1,\"X\")))","v":{"$error":"#REF!"}},{"$f":"IF(#REF!=\"\",\"\",\"X\")","v":{"$error":"#REF!"}}]
[null,null,null,null,null,null,null,null,null,null,null,null,null,null,null,{"$f":"IF(#REF!=\"\",\"\",IF(#REF!<TODAY(),0,IF(#REF!<(TODAY()+365),1,\"X\")))","v":{"$error":"#REF!"}},{"$f":"IF(#REF!=\"\",\"\",\"X\")","v":{"$error":"#REF!"}}]
[null,null,null,null,null,null,null,null,null,null,null,null,null,null,null,{"$f":"IF(#REF!=\"\",\"\",IF(#REF!<TODAY(),0,IF(#REF!<(TODAY()+365),1,\"X\")))","v":{"$error":"#REF!"}},{"$f":"IF(#REF!=\"\",\"\",\"X\")","v":{"$error":"#REF!"}}]
[null,null,null,null,null,null,null,null,null,null,null,null,null,null,null,{"$f":"IF(#REF!=\"\",\"\",IF(#REF!<TODAY(),0,IF(#REF!<(TODAY()+365),1,\"X\")))","v":{"$error":"#REF!"}},{"$f":"IF(#REF!=\"\",\"\",\"X\")","v":{"$error":"#REF!"}}]
[null,null,null,null,null,null,null,null,null,null,null,null,null,null,null,{"$f":"IF(#REF!=\"\",\"\",IF(#REF!<TODAY(),0,IF(#REF!<(TODAY()+365),1,\"X\")))","v":{"$error":"#REF!"}},{"$f":"IF(#REF!=\"\",\"\",\"X\")","v":{"$error":"#REF!"}}]
[null,null,null,null,null,null,null,null,null,null,null,null,null,null,null,{"$f":"IF(#REF!=\"\",\"\",IF(#REF!<TODAY(),0,IF(#REF!<(TODAY()+365),1,\"X\")))","v":{"$error":"#REF!"}},{"$f":"IF(#REF!=\"\",\"\",\"X\")","v":{"$error":"#REF!"}}]
[null,null,null,null,null,null,null,null,null,null,null,null,null,null,null,{"$f":"IF(#REF!=\"\",\"\",IF(#REF!<TODAY(),0,IF(#REF!<(TODAY()+365),1,\"X\")))","v":{"$error":"#REF!"}},{"$f":"IF(#REF!=\"\",\"\",\"X\")","v":{"$error":"#REF!"}}]
[null,null,null,null,null,null,null,null,null,null,null,null,null,null,null,{"$f":"IF(#REF!=\"\",\"\",IF(#REF!<TODAY(),0,IF(#REF!<(TODAY()+365),1,\"X\")))","v":{"$error":"#REF!"}},{"$f":"IF(#REF!=\"\",\"\",\"X\")","v":{"$error":"#REF!"}}]
[null,null,null,null,null,null,null,null,null,null,null,null,null,null,null,{"$f":"IF(#REF!=\"\",\"\",IF(#REF!<TODAY(),0,IF(#REF!<(TODAY()+365),1,\"X\")))","v":{"$error":"#REF!"}},{"$f":"IF(#REF!=\"\",\"\",\"X\")","v":{"$error":"#REF!"}}]
[null,null,null,null,null,null,null,null,null,null,null,null,null,null,null,{"$f":"IF(#REF!=\"\",\"\",IF(#REF!<TODAY(),0,IF(#REF!<(TODAY()+365),1,\"X\")))","v":{"$error":"#REF!"}},{"$f":"IF(#REF!=\"\",\"\",\"X\")","v":{"$error":"#REF!"}}]
[null,null,null,null,null,null,null,null,null,null,null,null,null,null,null,{"$f":"IF(#REF!=\"\",\"\",IF(#REF!<TODAY(),0,IF(#REF!<(TODAY()+365),1,\"X\")))","v":{"$error":"#REF!"}},{"$f":"IF(#REF!=\"\",\"\",\"X\")","v":{"$error":"#REF!"}}]
[null,null,null,null,null,null,null,null,null,null,null,null,null,null,null,{"$f":"IF(#REF!=\"\",\"\",IF(#REF!<TODAY(),0,IF(#REF!<(TODAY()+365),1,\"X\")))","v":{"$error":"#REF!"}},{"$f":"IF(#REF!=\"\",\"\",\"X\")","v":{"$error":"#REF!"}}]
[null,null,null,null,null,null,null,null,null,null,null,null,null,null,null,{"$f":"IF(#REF!=\"\",\"\",IF(#REF!<TODAY(),0,IF(#REF!<(TODAY()+365),1,\"X\")))","v":{"$error":"#REF!"}},{"$f":"IF(#REF!=\"\",\"\",\"X\")","v":{"$error":"#REF!"}}]
[null,null,null,null,null,null,null,null,null,null,null,null,null,null,null,{"$f":"IF(#REF!=\"\",\"\",IF(#REF!<TODAY(),0,IF(#REF!<(TODAY()+365),1,\"X\")))","v":{"$error":"#REF!"}},{"$f":"IF(#REF!=\"\",\"\",\"X\")","v":{"$error":"#REF!"}}]
[null,null,null,null,null,null,null,null,null,null,null,null,null,null,null,{"$f":"IF(#REF!=\"\",\"\",IF(#REF!<TODAY(),0,IF(#REF!<(TODAY()+365),1,\"X\")))","v":{"$error":"#REF!"}},{"$f":"IF(#REF!=\"\",\"\",\"X\")","v":{"$error":"#REF!"}}]
[null,null,null,null,null,null,null,null,null,null,null,null,null,null,null,{"$f":"IF(#REF!=\"\",\"\",IF(#REF!<TODAY(),0,IF(#REF!<(TODAY()+365),1,\"X\")))","v":{"$error":"#REF!"}},{"$f":"IF(#REF!=\"\",\"\",\"X\")","v":{"$error":"#REF!"}}]
[null,null,null,null,null,null,null,null,null,null,null,null,null,null,null,{"$f":"IF(#REF!=\"\",\"\",IF(#REF!<TODAY(),0,IF(#REF!<(TODAY()+365),1,\"X\")))","v":{"$error":"#REF!"}},{"$f":"IF(#REF!=\"\",\"\",\"X\")","v":{"$error":"#REF!"}}]
[null,null,null,null,null,null,null,null,null,null,null,null,null,null,null,{"$f":"IF(#REF!=\"\",\"\",IF(#REF!<TODAY(),0,IF(#REF!<(TODAY()+365),1,\"X\")))","v":{"$error":"#REF!"}},{"$f":"IF(#REF!=\"\",\"\",\"X\")","v":{"$error":"#REF!"}}]
[null,null,null,null,null,null,null,null,null,null,null,null,null,null,null,{"$f":"IF(#REF!=\"\",\"\",IF(#REF!<TODAY(),0,IF(#REF!<(TODAY()+365),1,\"X\")))","v":{"$error":"#REF!"}},{"$f":"IF(#REF!=\"\",\"\",\"X\")","v":{"$error":"#REF!"}}]
[null,null,null,null,null,null,null,null,null,null,null,null,null,null,null,{"$f":"IF(#REF!=\"\",\"\",IF(#REF!<TODAY(),0,IF(#REF!<(TODAY()+365),1,\"X\")))","v":{"$error":"#REF!"}},{"$f":"IF(#REF!=\"\",\"\",\"X\")","v":{"$error":"#REF!"}}]
[null,null,null,null,null,null,null,null,null,null,null,null,null,null,null,{"$f":"IF(#REF!=\"\",\"\",IF(#REF!<TODAY(),0,IF(#REF!<(TODAY()+365),1,\"X\")))","v":{"$error":"#REF!"}},{"$f":"IF(#REF!=\"\",\"\",\"X\")","v":{"$error":"#REF!"}}]
[null,null,null,null,null,null,null,null,null,null,null,null,null,null,null,{"$f":"IF(#REF!=\"\",\"\",IF(#REF!<TODAY(),0,IF(#REF!<(TODAY()+365),1,\"X\")))","v":{"$error":"#REF!"}},{"$f":"IF(#REF!=\"\",\"\",\"X\")","v":{"$error":"#REF!"}}]
[null,null,null,null,null,null,null,null,null,null,null,null,null,null,null,{"$f":"IF(#REF!=\"\",\"\",IF(#REF!<TODAY(),0,IF(#REF!<(TODAY()+365),1,\"X\")))","v":{"$error":"#REF!"}},{"$f":"IF(#REF!=\"\",\"\",\"X\")","v":{"$error":"#REF!"}}]
[null,null,null,null,null,null,null,null,null,null,null,null,null,null,null,{"$f":"IF(#REF!=\"\",\"\",IF(#REF!<TODAY(),0,IF(#REF!<(TODAY()+365),1,\"X\")))","v":{"$error":"#REF!"}},{"$f":"IF(#REF!=\"\",\"\",\"X\")","v":{"$error":"#REF!"}}]
[null,null,null,null,null,null,null,null,null,null,null,null,null,null,null,{"$f":"IF(#REF!=\"\",\"\",IF(#REF!<TODAY(),0,IF(#REF!<(TODAY()+365),1,\"X\")))","v":{"$error":"#REF!"}},{"$f":"IF(#REF!=\"\",\"\",\"X\")","v":{"$error":"#REF!"}}]
[null,null,null,null,null,null,null,null,null,null,null,null,null,null,null,{"$f":"IF(#REF!=\"\",\"\",IF(#REF!<TODAY(),0,IF(#REF!<(TODAY()+365),1,\"X\")))","v":{"$error":"#REF!"}},{"$f":"IF(#REF!=\"\",\"\",\"X\")","v":{"$error":"#REF!"}}]
[null,null,null,null,null,null,null,null,null,null,null,null,null,null,null,{"$f":"IF(#REF!=\"\",\"\",IF(#REF!<TODAY(),0,IF(#REF!<(TODAY()+365),1,\"X\")))","v":{"$error":"#REF!"}},{"$f":"IF(#REF!=\"\",\"\",\"X\")","v":{"$error":"#REF!"}}]
[null,null,null,null,null,null,null,null,null,null,null,null,null,null,null,{"$f":"IF(#REF!=\"\",\"\",IF(#REF!<TODAY(),0,IF(#REF!<(TODAY()+365),1,\"X\")))","v":{"$error":"#REF!"}},{"$f":"IF(#REF!=\"\",\"\",\"X\")","v":{"$error":"#REF!"}}]
[null,null,null,null,null,null,null,null,null,null,null,null,null,null,null,{"$f":"IF(#REF!=\"\",\"\",IF(#REF!<TODAY(),0,IF(#REF!<(TODAY()+365),1,\"X\")))","v":{"$error":"#REF!"}},{"$f":"IF(#REF!=\"\",\"\",\"X\")","v":{"$error":"#REF!"}}]
[null,null,null,null,null,null,null,null,null,null,null,null,null,null,null,{"$f":"IF(#REF!=\"\",\"\",IF(#REF!<TODAY(),0,IF(#REF!<(TODAY()+365),1,\"X\")))","v":{"$error":"#REF!"}},{"$f":"IF(#REF!=\"\",\"\",\"X\")","v":{"$error":"#REF!"}}]
[null,null,null,null,null,null,null,null,null,null,null,null,null,null,null,{"$f":"IF(#REF!=\"\",\"\",IF(#REF!<TODAY(),0,IF(#REF!<(TODAY()+365),1,\"X\")))","v":{"$error":"#REF!"}},{"$f":"IF(#REF!=\"\",\"\",\"X\")","v":{"$error":"#REF!"}}]
[null,null,null,null,null,null,null,null,null,null,null,null,null,null,null,{"$f":"IF(#REF!=\"\",\"\",IF(#REF!<TODAY(),0,IF(#REF!<(TODAY()+365),1,\"X\")))","v":{"$error":"#REF!"}},{"$f":"IF(#REF!=\"\",\"\",\"X\")","v":{"$error":"#REF!"}}]
[null,null,null,null,null,null,null,null,null,null,null,null,null,null,null,{"$f":"IF(#REF!=\"\",\"\",IF(#REF!<TODAY(),0,IF(#REF!<(TODAY()+365),1,\"X\")))","v":{"$error":"#REF!"}},{"$f":"IF(#REF!=\"\",\"\",\"X\")","v":{"$error":"#REF!"}}]
[null,null,null,null,null,null,null,null,null,null,null,null,null,null,null,{"$f":"IF(#REF!=\"\",\"\",IF(#REF!<TODAY(),0,IF(#REF!<(TODAY()+365),1,\"X\")))","v":{"$error":"#REF!"}},{"$f":"IF(#REF!=\"\",\"\",\"X\")","v":{"$error":"#REF!"}}]
[null,null,null,null,null,null,null,null,null,null,null,null,null,null,null,{"$f":"IF(#REF!=\"\",\"\",IF(#REF!<TODAY(),0,IF(#REF!<(TODAY()+365),1,\"X\")))","v":{"$error":"#REF!"}},{"$f":"IF(#REF!=\"\",\"\",\"X\")","v":{"$error":"#REF!"}}]
[null,null,null,null,null,null,null,null,null,null,null,null,null,null,null,{"$f":"IF(#REF!=\"\",\"\",IF(#REF!<TODAY(),0,IF(#REF!<(TODAY()+365),1,\"X\")))","v":{"$error":"#REF!"}},{"$f":"IF(#REF!=\"\",\"\",\"X\")","v":{"$error":"#REF!"}}]
[null,null,null,null,null,null,null,null,null,null,null,null,null,null,null,{"$f":"IF(#REF!=\"\",\"\",IF(#REF!<TODAY(),0,IF(#REF!<(TODAY()+365),1,\"X\")))","v":{"$error":"#REF!"}},{"$f":"IF(#REF!=\"\",\"\",\"X\")","v":{"$error":"#REF!"}}]
[null,null,null,null,null,null,null,null,null,null,null,null,null,null,null,{"$f":"IF(#REF!=\"\",\"\",IF(#REF!<TODAY(),0,IF(#REF!<(TODAY()+365),1,\"X\")))","v":{"$error":"#REF!"}},{"$f":"IF(#REF!=\"\",\"\",\"X\")","v":{"$error":"#REF!"}}]
[null,null,null,null,null,null,null,null,null,null,null,null,null,null,null,{"$f":"IF(#REF!=\"\",\"\",IF(#REF!<TODAY(),0,IF(#REF!<(TODAY()+365),1,\"X\")))","v":{"$error":"#REF!"}},{"$f":"IF(#REF!=\"\",\"\",\"X\")","v":{"$error":"#REF!"}}]
[null,null,null,null,null,null,null,null,null,null,null,null,null,null,null,{"$f":"IF(#REF!=\"\",\"\",IF(#REF!<TODAY(),0,IF(#REF!<(TODAY()+365),1,\"X\")))","v":{"$error":"#REF!"}},{"$f":"IF(#REF!=\"\",\"\",\"X\")","v":{"$error":"#REF!"}}]
[null,null,null,null,null,null,null,null,null,null,null,null,null,null,null,{"$f":"IF(#REF!=\"\",\"\",IF(#REF!<TODAY(),0,IF(#REF!<(TODAY()+365),1,\"X\")))","v":{"$error":"#REF!"}},{"$f":"IF(#REF!=\"\",\"\",\"X\")","v":{"$error":"#REF!"}}]
[null,null,null,null,null,null,null,null,null,null,null,null,null,null,null,{"$f":"IF(#REF!=\"\",\"\",IF(#REF!<TODAY(),0,IF(#REF!<(TODAY()+365),1,\"X\")))","v":{"$error":"#REF!"}},{"$f":"IF(#REF!=\"\",\"\",\"X\")","v":{"$error":"#REF!"}}]
[null,null,null,null,null,null,null,null,null,null,null,null,null,null,null,{"$f":"IF(#REF!=\"\",\"\",IF(#REF!<TODAY(),0,IF(#REF!<(TODAY()+365),1,\"X\")))","v":{"$error":"#REF!"}},{"$f":"IF(#REF!=\"\",\"\",\"X\")","v":{"$error":"#REF!"}}]
[null,null,null,null,null,null,null,null,null,null,null,null,null,null,null,{"$f":"IF(#REF!=\"\",\"\",IF(#REF!<TODAY(),0,IF(#REF!<(TODAY()+365),1,\"X\")))","v":{"$error":"#REF!"}},{"$f":"IF(#REF!=\"\",\"\",\"X\")","v":{"$error":"#REF!"}}]
[null,null,null,null,null,null,null,null,null,null,null,null,null,null,null,{"$f":"IF(#REF!=\"\",\"\",IF(#REF!<TODAY(),0,IF(#REF!<(TODAY()+365),1,\"X\")))","v":{"$error":"#REF!"}},{"$f":"IF(#REF!=\"\",\"\",\"X\")","v":{"$error":"#REF!"}}]
[null,null,null,null,null,null,null,null,null,null,null,null,null,null,null,{"$f":"IF(#REF!=\"\",\"\",IF(#REF!<TODAY(),0,IF(#REF!<(TODAY()+365),1,\"X\")))","v":{"$error":"#REF!"}},{"$f":"IF(#REF!=\"\",\"\",\"X\")","v":{"$error":"#REF!"}}]
[null,null,null,null,null,null,null,null,null,null,null,null,null,null,null,{"$f":"IF(#REF!=\"\",\"\",IF(#REF!<TODAY(),0,IF(#REF!<(TODAY()+365),1,\"X\")))","v":{"$error":"#REF!"}},{"$f":"IF(#REF!=\"\",\"\",\"X\")","v":{"$error":"#REF!"}}]
[null,null,null,null,null,null,null,null,null,null,null,null,null,null,null,{"$f":"IF(#REF!=\"\",\"\",IF(#REF!<TODAY(),0,IF(#REF!<(TODAY()+365),1,\"X\")))","v":{"$error":"#REF!"}},{"$f":"IF(#REF!=\"\",\"\",\"X\")","v":{"$error":"#REF!"}}]
[null,null,null,null,null,null,null,null,null,null,null,null,null,null,null,{"$f":"IF(#REF!=\"\",\"\",IF(#REF!<TODAY(),0,IF(#REF!<(TODAY()+365),1,\"X\")))","v":{"$error":"#REF!"}},{"$f":"IF(#REF!=\"\",\"\",\"X\")","v":{"$error":"#REF!"}}]
[null,null,null,null,null,null,null,null,null,null,null,null,null,null,null,{"$f":"IF(#REF!=\"\",\"\",IF(#REF!<TODAY(),0,IF(#REF!<(TODAY()+365),1,\"X\")))","v":{"$error":"#REF!"}},{"$f":"IF(#REF!=\"\",\"\",\"X\")","v":{"$error":"#REF!"}}]
[null,null,null,null,null,null,null,null,null,null,null,null,null,null,null,{"$f":"IF(#REF!=\"\",\"\",IF(#REF!<TODAY(),0,IF(#REF!<(TODAY()+365),1,\"X\")))","v":{"$error":"#REF!"}},{"$f":"IF(#REF!=\"\",\"\",\"X\")","v":{"$error":"#REF!"}}]
[null,null,null,null,null,null,null,null,null,null,null,null,null,null,null,{"$f":"IF(#REF!=\"\",\"\",IF(#REF!<TODAY(),0,IF(#REF!<(TODAY()+365),1,\"X\")))","v":{"$error":"#REF!"}},{"$f":"IF(#REF!=\"\",\"\",\"X\")","v":{"$error":"#REF!"}}]
[null,null,null,null,null,null,null,null,null,null,null,null,null,null,null,{"$f":"IF(#REF!=\"\",\"\",IF(#REF!<TODAY(),0,IF(#REF!<(TODAY()+365),1,\"X\")))","v":{"$error":"#REF!"}},{"$f":"IF(#REF!=\"\",\"\",\"X\")","v":{"$error":"#REF!"}}]
[null,null,null,null,null,null,null,null,null,null,null,null,null,null,null,{"$f":"IF(#REF!=\"\",\"\",IF(#REF!<TODAY(),0,IF(#REF!<(TODAY()+365),1,\"X\")))","v":{"$error":"#REF!"}},{"$f":"IF(#REF!=\"\",\"\",\"X\")","v":{"$error":"#REF!"}}]
[null,null,null,null,null,null,null,null,null,null,null,null,null,null,null,{"$f":"IF(#REF!=\"\",\"\",IF(#REF!<TODAY(),0,IF(#REF!<(TODAY()+365),1,\"X\")))","v":{"$error":"#REF!"}},{"$f":"IF(#REF!=\"\",\"\",\"X\")","v":{"$error":"#REF!"}}]
[null,null,null,null,null,null,null,null,null,null,null,null,null,null,null,{"$f":"IF(#REF!=\"\",\"\",IF(#REF!<TODAY(),0,IF(#REF!<(TODAY()+365),1,\"X\")))","v":{"$error":"#REF!"}},{"$f":"IF(#REF!=\"\",\"\",\"X\")","v":{"$error":"#REF!"}}]
[null,null,null,null,null,null,null,null,null,null,null,null,null,null,null,{"$f":"IF(#REF!=\"\",\"\",IF(#REF!<TODAY(),0,IF(#REF!<(TODAY()+365),1,\"X\")))","v":{"$error":"#REF!"}},{"$f":"IF(#REF!=\"\",\"\",\"X\")","v":{"$error":"#REF!"}}]
[null,null,null,null,null,null,null,null,null,null,null,null,null,null,null,{"$f":"IF(#REF!=\"\",\"\",IF(#REF!<TODAY(),0,IF(#REF!<(TODAY()+365),1,\"X\")))","v":{"$error":"#REF!"}},{"$f":"IF(#REF!=\"\",\"\",\"X\")","v":{"$error":"#REF!"}}]
[null,null,null,null,null,null,null,null,null,null,null,null,null,null,null,{"$f":"IF(#REF!=\"\",\"\",IF(#REF!<TODAY(),0,IF(#REF!<(TODAY()+365),1,\"X\")))","v":{"$error":"#REF!"}},{"$f":"IF(#REF!=\"\",\"\",\"X\")","v":{"$error":"#REF!"}}]
[null,null,null,null,null,null,null,null,null,null,null,null,null,null,null,{"$f":"IF(#REF!=\"\",\"\",IF(#REF!<TODAY(),0,IF(#REF!<(TODAY()+365),1,\"X\")))","v":{"$error":"#REF!"}},{"$f":"IF(#REF!=\"\",\"\",\"X\")","v":{"$error":"#REF!"}}]
[null,null,null,null,null,null,null,null,null,null,null,null,null,null,null,{"$f":"IF(#REF!=\"\",\"\",IF(#REF!<TODAY(),0,IF(#REF!<(TODAY()+365),1,\"X\")))","v":{"$error":"#REF!"}},{"$f":"IF(#REF!=\"\",\"\",\"X\")","v":{"$error":"#REF!"}}]
[null,null,null,null,null,null,null,null,null,null,null,null,null,null,null,{"$f":"IF(#REF!=\"\",\"\",IF(#REF!<TODAY(),0,IF(#REF!<(TODAY()+365),1,\"X\")))","v":{"$error":"#REF!"}},{"$f":"IF(#REF!=\"\",\"\",\"X\")","v":{"$error":"#REF!"}}]
[null,null,null,null,null,null,null,null,null,null,null,null,null,null,null,{"$f":"IF(#REF!=\"\",\"\",IF(#REF!<TODAY(),0,IF(#REF!<(TODAY()+365),1,\"X\")))","v":{"$error":"#REF!"}},{"$f":"IF(#REF!=\"\",\"\",\"X\")","v":{"$error":"#REF!"}}]
[null,null,null,null,null,null,null,null,null,null,null,null,null,null,null,{"$f":"IF(#REF!=\"\",\"\",IF(#REF!<TODAY(),0,IF(#REF!<(TODAY()+365),1,\"X\")))","v":{"$error":"#REF!"}},{"$f":"IF(#REF!=\"\",\"\",\"X\")","v":{"$error":"#REF!"}}]
[null,null,null,null,null,null,null,null,null,null,null,null,null,null,null,{"$f":"IF(#REF!=\"\",\"\",IF(#REF!<TODAY(),0,IF(#REF!<(TODAY()+365),1,\"X\")))","v":{"$error":"#REF!"}},{"$f":"IF(#REF!=\"\",\"\",\"X\")","v":{"$error":"#REF!"}}]
[null,null,null,null,null,null,null,null,null,null,null,null,null,null,null,{"$f":"IF(#REF!=\"\",\"\",IF(#REF!<TODAY(),0,IF(#REF!<(TODAY()+365),1,\"X\")))","v":{"$error":"#REF!"}},{"$f":"IF(#REF!=\"\",\"\",\"X\")","v":{"$error":"#REF!"}}]
[null,null,null,null,null,null,null,null,null,null,null,null,null,null,null,{"$f":"IF(#REF!=\"\",\"\",IF(#REF!<TODAY(),0,IF(#REF!<(TODAY()+365),1,\"X\")))","v":{"$error":"#REF!"}},{"$f":"IF(#REF!=\"\",\"\",\"X\")","v":{"$error":"#REF!"}}]
[null,null,null,null,null,null,null,null,null,null,null,null,null,null,null,{"$f":"IF(#REF!=\"\",\"\",IF(#REF!<TODAY(),0,IF(#REF!<(TODAY()+365),1,\"X\")))","v":{"$error":"#REF!"}},{"$f":"IF(#REF!=\"\",\"\",\"X\")","v":{"$error":"#REF!"}}]
[null,null,null,null,null,null,null,null,null,null,null,null,null,null,null,{"$f":"IF(#REF!=\"\",\"\",IF(#REF!<TODAY(),0,IF(#REF!<(TODAY()+365),1,\"X\")))","v":{"$error":"#REF!"}},{"$f":"IF(#REF!=\"\",\"\",\"X\")","v":{"$error":"#REF!"}}]
[null,null,null,null,null,null,null,null,null,null,null,null,null,null,null,{"$f":"IF(#REF!=\"\",\"\",IF(#REF!<TODAY(),0,IF(#REF!<(TODAY()+365),1,\"X\")))","v":{"$error":"#REF!"}},{"$f":"IF(#REF!=\"\",\"\",\"X\")","v":{"$error":"#REF!"}}]
[null,null,null,null,null,null,null,null,null,null,null,null,null,null,null,{"$f":"IF(#REF!=\"\",\"\",IF(#REF!<TODAY(),0,IF(#REF!<(TODAY()+365),1,\"X\")))","v":{"$error":"#REF!"}},{"$f":"IF(#REF!=\"\",\"\",\"X\")","v":{"$error":"#REF!"}}]
[null,null,null,null,null,null,null,null,null,null,null,null,null,null,null,{"$f":"IF(#REF!=\"\",\"\",IF(#REF!<TODAY(),0,IF(#REF!<(TODAY()+365),1,\"X\")))","v":{"$error":"#REF!"}},{"$f":"IF(#REF!=\"\",\"\",\"X\")","v":{"$error":"#REF!"}}]
[null,null,null,null,null,null,null,null,null,null,null,null,null,null,null,{"$f":"IF(#REF!=\"\",\"\",IF(#REF!<TODAY(),0,IF(#REF!<(TODAY()+365),1,\"X\")))","v":{"$error":"#REF!"}},{"$f":"IF(#REF!=\"\",\"\",\"X\")","v":{"$error":"#REF!"}}]
[null,null,null,null,null,null,null,null,null,null,null,null,null,null,null,{"$f":"IF(#REF!=\"\",\"\",IF(#REF!<TODAY(),0,IF(#REF!<(TODAY()+365),1,\"X\")))","v":{"$error":"#REF!"}},{"$f":"IF(#REF!=\"\",\"\",\"X\")","v":{"$error":"#REF!"}}]
[null,null,null,null,null,null,null,null,null,null,null,null,null,null,null,{"$f":"IF(#REF!=\"\",\"\",IF(#REF!<TODAY(),0,IF(#REF!<(TODAY()+365),1,\"X\")))","v":{"$error":"#REF!"}},{"$f":"IF(#REF!=\"\",\"\",\"X\")","v":{"$error":"#REF!"}}]
[null,null,null,null,null,null,null,null,null,null,null,null,null,null,null,{"$f":"IF(#REF!=\"\",\"\",IF(#REF!<TODAY(),0,IF(#REF!<(TODAY()+365),1,\"X\")))","v":{"$error":"#REF!"}},{"$f":"IF(#REF!=\"\",\"\",\"X\")","v":{"$error":"#REF!"}}]
[null,null,null,null,null,null,null,null,null,null,null,null,null,null,null,{"$f":"IF(#REF!=\"\",\"\",IF(#REF!<TODAY(),0,IF(#REF!<(TODAY()+365),1,\"X\")))","v":{"$error":"#REF!"}},{"$f":"IF(#REF!=\"\",\"\",\"X\")","v":{"$error":"#REF!"}}]
[null,null,null,null,null,null,null,null,null,null,null,null,null,null,null,{"$f":"IF(#REF!=\"\",\"\",IF(#REF!<TODAY(),0,IF(#REF!<(TODAY()+365),1,\"X\")))","v":{"$error":"#REF!"}},{"$f":"IF(#REF!=\"\",\"\",\"X\")","v":{"$error":"#REF!"}}]
[null,null,null,null,null,null,null,null,null,null,null,null,null,null,null,{"$f":"IF(#REF!=\"\",\"\",IF(#REF!<TODAY(),0,IF(#REF!<(TODAY()+365),1,\"X\")))","v":{"$error":"#REF!"}},{"$f":"IF(#REF!=\"\",\"\",\"X\")","v":{"$error":"#REF!"}}]
[null,null,null,null,null,null,null,null,null,null,null,null,null,null,null,{"$f":"IF(#REF!=\"\",\"\",IF(#REF!<TODAY(),0,IF(#REF!<(TODAY()+365),1,\"X\")))","v":{"$error":"#REF!"}},{"$f":"IF(#REF!=\"\",\"\",\"X\")","v":{"$error":"#REF!"}}]
[null,null,null,null,null,null,null,null,null,null,null,null,null,null,null,{"$f":"IF(#REF!=\"\",\"\",IF(#REF!<TODAY(),0,IF(#REF!<(TODAY()+365),1,\"X\")))","v":{"$error":"#REF!"}},{"$f":"IF(#REF!=\"\",\"\",\"X\")","v":{"$error":"#REF!"}}]
[null,null,null,null,null,null,null,null,null,null,null,null,null,null,null,{"$f":"IF(#REF!=\"\",\"\",IF(#REF!<TODAY(),0,IF(#REF!<(TODAY()+365),1,\"X\")))","v":{"$error":"#REF!"}},{"$f":"IF(#REF!=\"\",\"\",\"X\")","v":{"$error":"#REF!"}}]
[null,null,null,null,null,null,null,null,null,null,null,null,null,null,null,{"$f":"IF(#REF!=\"\",\"\",IF(#REF!<TODAY(),0,IF(#REF!<(TODAY()+365),1,\"X\")))","v":{"$error":"#REF!"}},{"$f":"IF(#REF!=\"\",\"\",\"X\")","v":{"$error":"#REF!"}}]
[null,null,null,null,null,null,null,null,null,null,null,null,null,null,null,{"$f":"IF(#REF!=\"\",\"\",IF(#REF!<TODAY(),0,IF(#REF!<(TODAY()+365),1,\"X\")))","v":{"$error":"#REF!"}},{"$f":"IF(#REF!=\"\",\"\",\"X\")","v":{"$error":"#REF!"}}]
[null,null,null,null,null,null,null,null,null,null,null,null,null,null,null,{"$f":"IF(#REF!=\"\",\"\",IF(#REF!<TODAY(),0,IF(#REF!<(TODAY()+365),1,\"X\")))","v":{"$error":"#REF!"}},{"$f":"IF(#REF!=\"\",\"\",\"X\")","v":{"$error":"#REF!"}}]
[null,null,null,null,null,null,null,null,null,null,null,null,null,null,null,{"$f":"IF(#REF!=\"\",\"\",IF(#REF!<TODAY(),0,IF(#REF!<(TODAY()+365),1,\"X\")))","v":{"$error":"#REF!"}},{"$f":"IF(#REF!=\"\",\"\",\"X\")","v":{"$error":"#REF!"}}]
[null,null,null,null,null,null,null,null,null,null,null,null,null,null,null,{"$f":"IF(#REF!=\"\",\"\",IF(#REF!<TODAY(),0,IF(#REF!<(TODAY()+365),1,\"X\")))","v":{"$error":"#REF!"}},{"$f":"IF(#REF!=\"\",\"\",\"X\")","v":{"$error":"#REF!"}}]
[null,null,null,null,null,null,null,null,null,null,null,null,null,null,null,{"$f":"IF(#REF!=\"\",\"\",IF(#REF!<TODAY(),0,IF(#REF!<(TODAY()+365),1,\"X\")))","v":{"$error":"#REF!"}},{"$f":"IF(#REF!=\"\",\"\",\"X\")","v":{"$error":"#REF!"}}]
[null,null,null,null,null,null,null,null,null,null,null,null,null,null,null,{"$f":"IF(#REF!=\"\",\"\",IF(#REF!<TODAY(),0,IF(#REF!<(TODAY()+365),1,\"X\")))","v":{"$error":"#REF!"}},{"$f":"IF(#REF!=\"\",\"\",\"X\")","v":{"$error":"#REF!"}}]
[null,null,null,null,null,null,null,null,null,null,null,null,null,null,null,{"$f":"IF(#REF!=\"\",\"\",IF(#REF!<TODAY(),0,IF(#REF!<(TODAY()+365),1,\"X\")))","v":{"$error":"#REF!"}},{"$f":"IF(#REF!=\"\",\"\",\"X\")","v":{"$error":"#REF!"}}]
[null,null,null,null,null,null,null,null,null,null,null,null,null,null,null,{"$f":"IF(#REF!=\"\",\"\",IF(#REF!<TODAY(),0,IF(#REF!<(TODAY()+365),1,\"X\")))","v":{"$error":"#REF!"}},{"$f":"IF(#REF!=\"\",\"\",\"X\")","v":{"$error":"#REF!"}}]
[null,null,null,null,null,null,null,null,null,null,null,null,null,null,null,{"$f":"IF(#REF!=\"\",\"\",IF(#REF!<TODAY(),0,IF(#REF!<(TODAY()+365),1,\"X\")))","v":{"$error":"#REF!"}},{"$f":"IF(#REF!=\"\",\"\",\"X\")","v":{"$error":"#REF!"}}]
[null,null,null,null,null,null,null,null,null,null,null,null,null,null,null,{"$f":"IF(#REF!=\"\",\"\",IF(#REF!<TODAY(),0,IF(#REF!<(TODAY()+365),1,\"X\")))","v":{"$error":"#REF!"}},{"$f":"IF(#REF!=\"\",\"\",\"X\")","v":{"$error":"#REF!"}}]
[null,null,null,null,null,null,null,null,null,null,null,null,null,null,null,{"$f":"IF(#REF!=\"\",\"\",IF(#REF!<TODAY(),0,IF(#REF!<(TODAY()+365),1,\"X\")))","v":{"$error":"#REF!"}},{"$f":"IF(#REF!=\"\",\"\",\"X\")","v":{"$error":"#REF!"}}]
[null,null,null,null,null,null,null,null,null,null,null,null,null,null,null,{"$f":"IF(#REF!=\"\",\"\",IF(#REF!<TODAY(),0,IF(#REF!<(TODAY()+365),1,\"X\")))","v":{"$error":"#REF!"}},{"$f":"IF(#REF!=\"\",\"\",\"X\")","v":{"$error":"#REF!"}}]
[null,null,null,null,null,null,null,null,null,null,null,null,null,null,null,{"$f":"IF(#REF!=\"\",\"\",IF(#REF!<TODAY(),0,IF(#REF!<(TODAY()+365),1,\"X\")))","v":{"$error":"#REF!"}},{"$f":"IF(#REF!=\"\",\"\",\"X\")","v":{"$error":"#REF!"}}]
[null,null,null,null,null,null,null,null,null,null,null,null,null,null,null,{"$f":"IF(#REF!=\"\",\"\",IF(#REF!<TODAY(),0,IF(#REF!<(TODAY()+365),1,\"X\")))","v":{"$error":"#REF!"}},{"$f":"IF(#REF!=\"\",\"\",\"X\")","v":{"$error":"#REF!"}}]
[null,null,null,null,null,null,null,null,null,null,null,null,null,null,null,{"$f":"IF(#REF!=\"\",\"\",IF(#REF!<TODAY(),0,IF(#REF!<(TODAY()+365),1,\"X\")))","v":{"$error":"#REF!"}},{"$f":"IF(#REF!=\"\",\"\",\"X\")","v":{"$error":"#REF!"}}]
[null,null,null,null,null,null,null,null,null,null,null,null,null,null,null,{"$f":"IF(#REF!=\"\",\"\",IF(#REF!<TODAY(),0,IF(#REF!<(TODAY()+365),1,\"X\")))","v":{"$error":"#REF!"}},{"$f":"IF(#REF!=\"\",\"\",\"X\")","v":{"$error":"#REF!"}}]
[null,null,null,null,null,null,null,null,null,null,null,null,null,null,null,{"$f":"IF(#REF!=\"\",\"\",IF(#REF!<TODAY(),0,IF(#REF!<(TODAY()+365),1,\"X\")))","v":{"$error":"#REF!"}},{"$f":"IF(#REF!=\"\",\"\",\"X\")","v":{"$error":"#REF!"}}]
[null,null,null,null,null,null,null,null,null,null,null,null,null,null,null,{"$f":"IF(#REF!=\"\",\"\",IF(#REF!<TODAY(),0,IF(#REF!<(TODAY()+365),1,\"X\")))","v":{"$error":"#REF!"}},{"$f":"IF(#REF!=\"\",\"\",\"X\")","v":{"$error":"#REF!"}}]
[null,null,null,null,null,null,null,null,null,null,null,null,null,null,null,{"$f":"IF(#REF!=\"\",\"\",IF(#REF!<TODAY(),0,IF(#REF!<(TODAY()+365),1,\"X\")))","v":{"$error":"#REF!"}},{"$f":"IF(#REF!=\"\",\"\",\"X\")","v":{"$error":"#REF!"}}]
[null,null,null,null,null,null,null,null,null,null,null,null,null,null,null,{"$f":"IF(#REF!=\"\",\"\",IF(#REF!<TODAY(),0,IF(#REF!<(TODAY()+365),1,\"X\")))","v":{"$error":"#REF!"}},{"$f":"IF(#REF!=\"\",\"\",\"X\")","v":{"$error":"#REF!"}}]
[null,null,null,null,null,null,null,null,null,null,null,null,null,null,null,{"$f":"IF(#REF!=\"\",\"\",IF(#REF!<TODAY(),0,IF(#REF!<(TODAY()+365),1,\"X\")))","v":{"$error":"#REF!"}},{"$f":"IF(#REF!=\"\",\"\",\"X\")","v":{"$error":"#REF!"}}]
[null,null,null,null,null,null,null,null,null,null,null,null,null,null,null,{"$f":"IF(#REF!=\"\",\"\",IF(#REF!<TODAY(),0,IF(#REF!<(TODAY()+365),1,\"X\")))","v":{"$error":"#REF!"}},{"$f":"IF(#REF!=\"\",\"\",\"X\")","v":{"$error":"#REF!"}}]
[null,null,null,null,null,null,null,null,null,null,null,null,null,null,null,{"$f":"IF(#REF!=\"\",\"\",IF(#REF!<TODAY(),0,IF(#REF!<(TODAY()+365),1,\"X\")))","v":{"$error":"#REF!"}},{"$f":"IF(#REF!=\"\",\"\",\"X\")","v":{"$error":"#REF!"}}]
[null,null,null,null,null,null,null,null,null,null,null,null,null,null,null,{"$f":"IF(#REF!=\"\",\"\",IF(#REF!<TODAY(),0,IF(#REF!<(TODAY()+365),1,\"X\")))","v":{"$error":"#REF!"}},{"$f":"IF(#REF!=\"\",\"\",\"X\")","v":{"$error":"#REF!"}}]
[null,null,null,null,null,null,null,null,null,null,null,null,null,null,null,{"$f":"IF(#REF!=\"\",\"\",IF(#REF!<TODAY(),0,IF(#REF!<(TODAY()+365),1,\"X\")))","v":{"$error":"#REF!"}},{"$f":"IF(#REF!=\"\",\"\",\"X\")","v":{"$error":"#REF!"}}]
[null,null,null,null,null,null,null,null,null,null,null,null,null,null,null,{"$f":"IF(#REF!=\"\",\"\",IF(#REF!<TODAY(),0,IF(#REF!<(TODAY()+365),1,\"X\")))","v":{"$error":"#REF!"}},{"$f":"IF(#REF!=\"\",\"\",\"X\")","v":{"$error":"#REF!"}}]
[null,null,null,null,null,null,null,null,null,null,null,null,null,null,null,{"$f":"IF(#REF!=\"\",\"\",IF(#REF!<TODAY(),0,IF(#REF!<(TODAY()+365),1,\"X\")))","v":{"$error":"#REF!"}},{"$f":"IF(#REF!=\"\",\"\",\"X\")","v":{"$error":"#REF!"}}]
[null,null,null,null,null,null,null,null,null,null,null,null,null,null,null,{"$f":"IF(#REF!=\"\",\"\",IF(#REF!<TODAY(),0,IF(#REF!<(TODAY()+365),1,\"X\")))","v":{"$error":"#REF!"}},{"$f":"IF(#REF!=\"\",\"\",\"X\")","v":{"$error":"#REF!"}}]
[null,null,null,null,null,null,null,null,null,null,null,null,null,null,null,{"$f":"IF(#REF!=\"\",\"\",IF(#REF!<TODAY(),0,IF(#REF!<(TODAY()+365),1,\"X\")))","v":{"$error":"#REF!"}},{"$f":"IF(#REF!=\"\",\"\",\"X\")","v":{"$error":"#REF!"}}]
[null,null,null,null,null,null,null,null,null,null,null,null,null,null,null,{"$f":"IF(#REF!=\"\",\"\",IF(#REF!<TODAY(),0,IF(#REF!<(TODAY()+365),1,\"X\")))","v":{"$error":"#REF!"}},{"$f":"IF(#REF!=\"\",\"\",\"X\")","v":{"$error":"#REF!"}}]
[null,null,null,null,null,null,null,null,null,null,null,null,null,null,null,{"$f":"IF(#REF!=\"\",\"\",IF(#REF!<TODAY(),0,IF(#REF!<(TODAY()+365),1,\"X\")))","v":{"$error":"#REF!"}},{"$f":"IF(#REF!=\"\",\"\",\"X\")","v":{"$error":"#REF!"}}]
[null,null,null,null,null,null,null,null,null,null,null,null,null,null,null,{"$f":"IF(#REF!=\"\",\"\",IF(#REF!<TODAY(),0,IF(#REF!<(TODAY()+365),1,\"X\")))","v":{"$error":"#REF!"}},{"$f":"IF(#REF!=\"\",\"\",\"X\")","v":{"$error":"#REF!"}}]
[null,null,null,null,null,null,null,null,null,null,null,null,null,null,null,{"$f":"IF(#REF!=\"\",\"\",IF(#REF!<TODAY(),0,IF(#REF!<(TODAY()+365),1,\"X\")))","v":{"$error":"#REF!"}},{"$f":"IF(#REF!=\"\",\"\",\"X\")","v":{"$error":"#REF!"}}]
[null,null,null,null,null,null,null,null,null,null,null,null,null,null,null,{"$f":"IF(#REF!=\"\",\"\",IF(#REF!<TODAY(),0,IF(#REF!<(TODAY()+365),1,\"X\")))","v":{"$error":"#REF!"}},{"$f":"IF(#REF!=\"\",\"\",\"X\")","v":{"$error":"#REF!"}}]
[null,null,null,null,null,null,null,null,null,null,null,null,null,null,null,{"$f":"IF(#REF!=\"\",\"\",IF(#REF!<TODAY(),0,IF(#REF!<(TODAY()+365),1,\"X\")))","v":{"$error":"#REF!"}},{"$f":"IF(#REF!=\"\",\"\",\"X\")","v":{"$error":"#REF!"}}]
[null,null,null,null,null,null,null,null,null,null,null,null,null,null,null,{"$f":"IF(#REF!=\"\",\"\",IF(#REF!<TODAY(),0,IF(#REF!<(TODAY()+365),1,\"X\")))","v":{"$error":"#REF!"}},{"$f":"IF(#REF!=\"\",\"\",\"X\")","v":{"$error":"#REF!"}}]
[null,null,null,null,null,null,null,null,null,null,null,null,null,null,null,{"$f":"IF(#REF!=\"\",\"\",IF(#REF!<TODAY(),0,IF(#REF!<(TODAY()+365),1,\"X\")))","v":{"$error":"#REF!"}},{"$f":"IF(#REF!=\"\",\"\",\"X\")","v":{"$error":"#REF!"}}]
[null,null,null,null,null,null,null,null,null,null,null,null,null,null,null,{"$f":"IF(#REF!=\"\",\"\",IF(#REF!<TODAY(),0,IF(#REF!<(TODAY()+365),1,\"X\")))","v":{"$error":"#REF!"}},{"$f":"IF(#REF!=\"\",\"\",\"X\")","v":{"$error":"#REF!"}}]
[null,null,null,null,null,null,null,null,null,null,null,null,null,null,null,{"$f":"IF(#REF!=\"\",\"\",IF(#REF!<TODAY(),0,IF(#REF!<(TODAY()+365),1,\"X\")))","v":{"$error":"#REF!"}},{"$f":"IF(#REF!=\"\",\"\",\"X\")","v":{"$error":"#REF!"}}]
[null,null,null,null,null,null,null,null,null,null,null,null,null,null,null,{"$f":"IF(#REF!=\"\",\"\",IF(#REF!<TODAY(),0,IF(#REF!<(TODAY()+365),1,\"X\")))","v":{"$error":"#REF!"}},{"$f":"IF(#REF!=\"\",\"\",\"X\")","v":{"$error":"#REF!"}}]
[null,null,null,null,null,null,null,null,null,null,null,null,null,null,null,{"$f":"IF(#REF!=\"\",\"\",IF(#REF!<TODAY(),0,IF(#REF!<(TODAY()+365),1,\"X\")))","v":{"$error":"#REF!"}},{"$f":"IF(#REF!=\"\",\"\",\"X\")","v":{"$error":"#REF!"}}]
[null,null,null,null,null,null,null,null,null,null,null,null,null,null,null,{"$f":"IF(#REF!=\"\",\"\",IF(#REF!<TODAY(),0,IF(#REF!<(TODAY()+365),1,\"X\")))","v":{"$error":"#REF!"}},{"$f":"IF(#REF!=\"\",\"\",\"X\")","v":{"$error":"#REF!"}}]
[null,null,null,null,null,null,null,null,null,null,null,null,null,null,null,{"$f":"IF(#REF!=\"\",\"\",IF(#REF!<TODAY(),0,IF(#REF!<(TODAY()+365),1,\"X\")))","v":{"$error":"#REF!"}},{"$f":"IF(#REF!=\"\",\"\",\"X\")","v":{"$error":"#REF!"}}]
[null,null,null,null,null,null,null,null,null,null,null,null,null,null,null,{"$f":"IF(#REF!=\"\",\"\",IF(#REF!<TODAY(),0,IF(#REF!<(TODAY()+365),1,\"X\")))","v":{"$error":"#REF!"}},{"$f":"IF(#REF!=\"\",\"\",\"X\")","v":{"$error":"#REF!"}}]
[null,null,null,null,null,null,null,null,null,null,null,null,null,null,null,{"$f":"IF(#REF!=\"\",\"\",IF(#REF!<TODAY(),0,IF(#REF!<(TODAY()+365),1,\"X\")))","v":{"$error":"#REF!"}},{"$f":"IF(#REF!=\"\",\"\",\"X\")","v":{"$error":"#REF!"}}]
[null,null,null,null,null,null,null,null,null,null,null,null,null,null,null,{"$f":"IF(#REF!=\"\",\"\",IF(#REF!<TODAY(),0,IF(#REF!<(TODAY()+365),1,\"X\")))","v":{"$error":"#REF!"}},{"$f":"IF(#REF!=\"\",\"\",\"X\")","v":{"$error":"#REF!"}}]
[null,null,null,null,null,null,null,null,null,null,null,null,null,null,null,{"$f":"IF(#REF!=\"\",\"\",IF(#REF!<TODAY(),0,IF(#REF!<(TODAY()+365),1,\"X\")))","v":{"$error":"#REF!"}},{"$f":"IF(#REF!=\"\",\"\",\"X\")","v":{"$error":"#REF!"}}]
[null,null,null,null,null,null,null,null,null,null,null,null,null,null,null,{"$f":"IF(#REF!=\"\",\"\",IF(#REF!<TODAY(),0,IF(#REF!<(TODAY()+365),1,\"X\")))","v":{"$error":"#REF!"}},{"$f":"IF(#REF!=\"\",\"\",\"X\")","v":{"$error":"#REF!"}}]
[null,null,null,null,null,null,null,null,null,null,null,null,null,null,null,{"$f":"IF(#REF!=\"\",\"\",IF(#REF!<TODAY(),0,IF(#REF!<(TODAY()+365),1,\"X\")))","v":{"$error":"#REF!"}},{"$f":"IF(#REF!=\"\",\"\",\"X\")","v":{"$error":"#REF!"}}]
[null,null,null,null,null,null,null,null,null,null,null,null,null,null,null,{"$f":"IF(#REF!=\"\",\"\",IF(#REF!<TODAY(),0,IF(#REF!<(TODAY()+365),1,\"X\")))","v":{"$error":"#REF!"}},{"$f":"IF(#REF!=\"\",\"\",\"X\")","v":{"$error":"#REF!"}}]
[null,null,null,null,null,null,null,null,null,null,null,null,null,null,null,{"$f":"IF(#REF!=\"\",\"\",IF(#REF!<TODAY(),0,IF(#REF!<(TODAY()+365),1,\"X\")))","v":{"$error":"#REF!"}},{"$f":"IF(#REF!=\"\",\"\",\"X\")","v":{"$error":"#REF!"}}]
[null,null,null,null,null,null,null,null,null,null,null,null,null,null,null,{"$f":"IF(#REF!=\"\",\"\",IF(#REF!<TODAY(),0,IF(#REF!<(TODAY()+365),1,\"X\")))","v":{"$error":"#REF!"}},{"$f":"IF(#REF!=\"\",\"\",\"X\")","v":{"$error":"#REF!"}}]
[null,null,null,null,null,null,null,null,null,null,null,null,null,null,null,{"$f":"IF(#REF!=\"\",\"\",IF(#REF!<TODAY(),0,IF(#REF!<(TODAY()+365),1,\"X\")))","v":{"$error":"#REF!"}},{"$f":"IF(#REF!=\"\",\"\",\"X\")","v":{"$error":"#REF!"}}]
[null,null,null,null,null,null,null,null,null,null,null,null,null,null,null,{"$f":"IF(#REF!=\"\",\"\",IF(#REF!<TODAY(),0,IF(#REF!<(TODAY()+365),1,\"X\")))","v":{"$error":"#REF!"}},{"$f":"IF(#REF!=\"\",\"\",\"X\")","v":{"$error":"#REF!"}}]
[null,null,null,null,null,null,null,null,null,null,null,null,null,null,null,{"$f":"IF(#REF!=\"\",\"\",IF(#REF!<TODAY(),0,IF(#REF!<(TODAY()+365),1,\"X\")))","v":{"$error":"#REF!"}},{"$f":"IF(#REF!=\"\",\"\",\"X\")","v":{"$error":"#REF!"}}]
[null,null,null,null,null,null,null,null,null,null,null,null,null,null,null,{"$f":"IF(#REF!=\"\",\"\",IF(#REF!<TODAY(),0,IF(#REF!<(TODAY()+365),1,\"X\")))","v":{"$error":"#REF!"}},{"$f":"IF(#REF!=\"\",\"\",\"X\")","v":{"$error":"#REF!"}}]
[null,null,null,null,null,null,null,null,null,null,null,null,null,null,null,{"$f":"IF(#REF!=\"\",\"\",IF(#REF!<TODAY(),0,IF(#REF!<(TODAY()+365),1,\"X\")))","v":{"$error":"#REF!"}},{"$f":"IF(#REF!=\"\",\"\",\"X\")","v":{"$error":"#REF!"}}]
[null,null,null,null,null,null,null,null,null,null,null,null,null,null,null,{"$f":"IF(#REF!=\"\",\"\",IF(#REF!<TODAY(),0,IF(#REF!<(TODAY()+365),1,\"X\")))","v":{"$error":"#REF!"}},{"$f":"IF(#REF!=\"\",\"\",\"X\")","v":{"$error":"#REF!"}}]
[null,null,null,null,null,null,null,null,null,null,null,null,null,null,null,{"$f":"IF(#REF!=\"\",\"\",IF(#REF!<TODAY(),0,IF(#REF!<(TODAY()+365),1,\"X\")))","v":{"$error":"#REF!"}},{"$f":"IF(#REF!=\"\",\"\",\"X\")","v":{"$error":"#REF!"}}]
[null,null,null,null,null,null,null,null,null,null,null,null,null,null,null,{"$f":"IF(#REF!=\"\",\"\",IF(#REF!<TODAY(),0,IF(#REF!<(TODAY()+365),1,\"X\")))","v":{"$error":"#REF!"}},{"$f":"IF(#REF!=\"\",\"\",\"X\")","v":{"$error":"#REF!"}}]
[null,null,null,null,null,null,null,null,null,null,null,null,null,null,null,{"$f":"IF(#REF!=\"\",\"\",IF(#REF!<TODAY(),0,IF(#REF!<(TODAY()+365),1,\"X\")))","v":{"$error":"#REF!"}},{"$f":"IF(#REF!=\"\",\"\",\"X\")","v":{"$error":"#REF!"}}]
[null,null,null,null,null,null,null,null,null,null,null,null,null,null,null,{"$f":"IF(#REF!=\"\",\"\",IF(#REF!<TODAY(),0,IF(#REF!<(TODAY()+365),1,\"X\")))","v":{"$error":"#REF!"}},{"$f":"IF(#REF!=\"\",\"\",\"X\")","v":{"$error":"#REF!"}}]
[null,null,null,null,null,null,null,null,null,null,null,null,null,null,null,{"$f":"IF(#REF!=\"\",\"\",IF(#REF!<TODAY(),0,IF(#REF!<(TODAY()+365),1,\"X\")))","v":{"$error":"#REF!"}},{"$f":"IF(#REF!=\"\",\"\",\"X\")","v":{"$error":"#REF!"}}]
[null,null,null,null,null,null,null,null,null,null,null,null,null,null,null,{"$f":"IF(#REF!=\"\",\"\",IF(#REF!<TODAY(),0,IF(#REF!<(TODAY()+365),1,\"X\")))","v":{"$error":"#REF!"}},{"$f":"IF(#REF!=\"\",\"\",\"X\")","v":{"$error":"#REF!"}}]
[null,null,null,null,null,null,null,null,null,null,null,null,null,null,null,{"$f":"IF(#REF!=\"\",\"\",IF(#REF!<TODAY(),0,IF(#REF!<(TODAY()+365),1,\"X\")))","v":{"$error":"#REF!"}},{"$f":"IF(#REF!=\"\",\"\",\"X\")","v":{"$error":"#REF!"}}]
[null,null,null,null,null,null,null,null,null,null,null,null,null,null,null,{"$f":"IF(#REF!=\"\",\"\",IF(#REF!<TODAY(),0,IF(#REF!<(TODAY()+365),1,\"X\")))","v":{"$error":"#REF!"}},{"$f":"IF(#REF!=\"\",\"\",\"X\")","v":{"$error":"#REF!"}}]
[null,null,null,null,null,null,null,null,null,null,null,null,null,null,null,{"$f":"IF(#REF!=\"\",\"\",IF(#REF!<TODAY(),0,IF(#REF!<(TODAY()+365),1,\"X\")))","v":{"$error":"#REF!"}},{"$f":"IF(#REF!=\"\",\"\",\"X\")","v":{"$error":"#REF!"}}]
[null,null,null,null,null,null,null,null,null,null,null,null,null,null,null,{"$f":"IF(#REF!=\"\",\"\",IF(#REF!<TODAY(),0,IF(#REF!<(TODAY()+365),1,\"X\")))","v":{"$error":"#REF!"}},{"$f":"IF(#REF!=\"\",\"\",\"X\")","v":{"$error":"#REF!"}}]
[null,null,null,null,null,null,null,null,null,null,null,null,null,null,null,{"$f":"IF(#REF!=\"\",\"\",IF(#REF!<TODAY(),0,IF(#REF!<(TODAY()+365),1,\"X\")))","v":{"$error":"#REF!"}},{"$f":"IF(#REF!=\"\",\"\",\"X\")","v":{"$error":"#REF!"}}]
[null,null,null,null,null,null,null,null,null,null,null,null,null,null,null,{"$f":"IF(#REF!=\"\",\"\",IF(#REF!<TODAY(),0,IF(#REF!<(TODAY()+365),1,\"X\")))","v":{"$error":"#REF!"}},{"$f":"IF(#REF!=\"\",\"\",\"X\")","v":{"$error":"#REF!"}}]
[null,null,null,null,null,null,null,null,null,null,null,null,null,null,null,{"$f":"IF(#REF!=\"\",\"\",IF(#REF!<TODAY(),0,IF(#REF!<(TODAY()+365),1,\"X\")))","v":{"$error":"#REF!"}},{"$f":"IF(#REF!=\"\",\"\",\"X\")","v":{"$error":"#REF!"}}]
[null,null,null,null,null,null,null,null,null,null,null,null,null,null,null,{"$f":"IF(#REF!=\"\",\"\",IF(#REF!<TODAY(),0,IF(#REF!<(TODAY()+365),1,\"X\")))","v":{"$error":"#REF!"}},{"$f":"IF(#REF!=\"\",\"\",\"X\")","v":{"$error":"#REF!"}}]
[null,null,null,null,null,null,null,null,null,null,null,null,null,null,null,{"$f":"IF(#REF!=\"\",\"\",IF(#REF!<TODAY(),0,IF(#REF!<(TODAY()+365),1,\"X\")))","v":{"$error":"#REF!"}},{"$f":"IF(#REF!=\"\",\"\",\"X\")","v":{"$error":"#REF!"}}]
[null,null,null,null,null,null,null,null,null,null,null,null,null,null,null,{"$f":"IF(#REF!=\"\",\"\",IF(#REF!<TODAY(),0,IF(#REF!<(TODAY()+365),1,\"X\")))","v":{"$error":"#REF!"}},{"$f":"IF(#REF!=\"\",\"\",\"X\")","v":{"$error":"#REF!"}}]
[null,null,null,null,null,null,null,null,null,null,null,null,null,null,null,{"$f":"IF(#REF!=\"\",\"\",IF(#REF!<TODAY(),0,IF(#REF!<(TODAY()+365),1,\"X\")))","v":{"$error":"#REF!"}},{"$f":"IF(#REF!=\"\",\"\",\"X\")","v":{"$error":"#REF!"}}]
[null,null,null,null,null,null,null,null,null,null,null,null,null,null,null,{"$f":"IF(#REF!=\"\",\"\",IF(#REF!<TODAY(),0,IF(#REF!<(TODAY()+365),1,\"X\")))","v":{"$error":"#REF!"}},{"$f":"IF(#REF!=\"\",\"\",\"X\")","v":{"$error":"#REF!"}}]
[null,null,null,null,null,null,null,null,null,null,null,null,null,null,null,{"$f":"IF(#REF!=\"\",\"\",IF(#REF!<TODAY(),0,IF(#REF!<(TODAY()+365),1,\"X\")))","v":{"$error":"#REF!"}},{"$f":"IF(#REF!=\"\",\"\",\"X\")","v":{"$error":"#REF!"}}]
[null,null,null,null,null,null,null,null,null,null,null,null,null,null,null,{"$f":"IF(#REF!=\"\",\"\",IF(#REF!<TODAY(),0,IF(#REF!<(TODAY()+365),1,\"X\")))","v":{"$error":"#REF!"}},{"$f":"IF(#REF!=\"\",\"\",\"X\")","v":{"$error":"#REF!"}}]
[null,null,null,null,null,null,null,null,null,null,null,null,null,null,null,{"$f":"IF(#REF!=\"\",\"\",IF(#REF!<TODAY(),0,IF(#REF!<(TODAY()+365),1,\"X\")))","v":{"$error":"#REF!"}},{"$f":"IF(#REF!=\"\",\"\",\"X\")","v":{"$error":"#REF!"}}]
[null,null,null,null,null,null,null,null,null,null,null,null,null,null,null,{"$f":"IF(#REF!=\"\",\"\",IF(#REF!<TODAY(),0,IF(#REF!<(TODAY()+365),1,\"X\")))","v":{"$error":"#REF!"}},{"$f":"IF(#REF!=\"\",\"\",\"X\")","v":{"$error":"#REF!"}}]
[null,null,null,null,null,null,null,null,null,null,null,null,null,null,null,{"$f":"IF(#REF!=\"\",\"\",IF(#REF!<TODAY(),0,IF(#REF!<(TODAY()+365),1,\"X\")))","v":{"$error":"#REF!"}},{"$f":"IF(#REF!=\"\",\"\",\"X\")","v":{"$error":"#REF!"}}]
[null,null,null,null,null,null,null,null,null,null,null,null,null,null,null,{"$f":"IF(#REF!=\"\",\"\",IF(#REF!<TODAY(),0,IF(#REF!<(TODAY()+365),1,\"X\")))","v":{"$error":"#REF!"}},{"$f":"IF(#REF!=\"\",\"\",\"X\")","v":{"$error":"#REF!"}}]
[null,null,null,null,null,null,null,null,null,null,null,null,null,null,null,{"$f":"IF(#REF!=\"\",\"\",IF(#REF!<TODAY(),0,IF(#REF!<(TODAY()+365),1,\"X\")))","v":{"$error":"#REF!"}},{"$f":"IF(#REF!=\"\",\"\",\"X\")","v":{"$error":"#REF!"}}]
[null,null,null,null,null,null,null,null,null,null,null,null,null,null,null,{"$f":"IF(#REF!=\"\",\"\",IF(#REF!<TODAY(),0,IF(#REF!<(TODAY()+365),1,\"X\")))","v":{"$error":"#REF!"}},{"$f":"IF(#REF!=\"\",\"\",\"X\")","v":{"$error":"#REF!"}}]
[null,null,null,null,null,null,null,null,null,null,null,null,null,null,null,{"$f":"IF(#REF!=\"\",\"\",IF(#REF!<TODAY(),0,IF(#REF!<(TODAY()+365),1,\"X\")))","v":{"$error":"#REF!"}},{"$f":"IF(#REF!=\"\",\"\",\"X\")","v":{"$error":"#REF!"}}]
[null,null,null,null,null,null,null,null,null,null,null,null,null,null,null,{"$f":"IF(#REF!=\"\",\"\",IF(#REF!<TODAY(),0,IF(#REF!<(TODAY()+365),1,\"X\")))","v":{"$error":"#REF!"}},{"$f":"IF(#REF!=\"\",\"\",\"X\")","v":{"$error":"#REF!"}}]
[null,null,null,null,null,null,null,null,null,null,null,null,null,null,null,{"$f":"IF(#REF!=\"\",\"\",IF(#REF!<TODAY(),0,IF(#REF!<(TODAY()+365),1,\"X\")))","v":{"$error":"#REF!"}},{"$f":"IF(#REF!=\"\",\"\",\"X\")","v":{"$error":"#REF!"}}]
[null,null,null,null,null,null,null,null,null,null,null,null,null,null,null,{"$f":"IF(#REF!=\"\",\"\",IF(#REF!<TODAY(),0,IF(#REF!<(TODAY()+365),1,\"X\")))","v":{"$error":"#REF!"}},{"$f":"IF(#REF!=\"\",\"\",\"X\")","v":{"$error":"#REF!"}}]
[null,null,null,null,null,null,null,null,null,null,null,null,null,null,null,{"$f":"IF(#REF!=\"\",\"\",IF(#REF!<TODAY(),0,IF(#REF!<(TODAY()+365),1,\"X\")))","v":{"$error":"#REF!"}},{"$f":"IF(#REF!=\"\",\"\",\"X\")","v":{"$error":"#REF!"}}]
[null,null,null,null,null,null,null,null,null,null,null,null,null,null,null,{"$f":"IF(#REF!=\"\",\"\",IF(#REF!<TODAY(),0,IF(#REF!<(TODAY()+365),1,\"X\")))","v":{"$error":"#REF!"}},{"$f":"IF(#REF!=\"\",\"\",\"X\")","v":{"$error":"#REF!"}}]
[null,null,null,null,null,null,null,null,null,null,null,null,null,null,null,{"$f":"IF(#REF!=\"\",\"\",IF(#REF!<TODAY(),0,IF(#REF!<(TODAY()+365),1,\"X\")))","v":{"$error":"#REF!"}},{"$f":"IF(#REF!=\"\",\"\",\"X\")","v":{"$error":"#REF!"}}]
[null,null,null,null,null,null,null,null,null,null,null,null,null,null,null,{"$f":"IF(#REF!=\"\",\"\",IF(#REF!<TODAY(),0,IF(#REF!<(TODAY()+365),1,\"X\")))","v":{"$error":"#REF!"}},{"$f":"IF(#REF!=\"\",\"\",\"X\")","v":{"$error":"#REF!"}}]
[null,null,null,null,null,null,null,null,null,null,null,null,null,null,null,{"$f":"IF(#REF!=\"\",\"\",IF(#REF!<TODAY(),0,IF(#REF!<(TODAY()+365),1,\"X\")))","v":{"$error":"#REF!"}},{"$f":"IF(#REF!=\"\",\"\",\"X\")","v":{"$error":"#REF!"}}]
[null,null,null,null,null,null,null,null,null,null,null,null,null,null,null,{"$f":"IF(#REF!=\"\",\"\",IF(#REF!<TODAY(),0,IF(#REF!<(TODAY()+365),1,\"X\")))","v":{"$error":"#REF!"}},{"$f":"IF(#REF!=\"\",\"\",\"X\")","v":{"$error":"#REF!"}}]
[null,null,null,null,null,null,null,null,null,null,null,null,null,null,null,{"$f":"IF(#REF!=\"\",\"\",IF(#REF!<TODAY(),0,IF(#REF!<(TODAY()+365),1,\"X\")))","v":{"$error":"#REF!"}},{"$f":"IF(#REF!=\"\",\"\",\"X\")","v":{"$error":"#REF!"}}]
[null,null,null,null,null,null,null,null,null,null,null,null,null,null,null,{"$f":"IF(#REF!=\"\",\"\",IF(#REF!<TODAY(),0,IF(#REF!<(TODAY()+365),1,\"X\")))","v":{"$error":"#REF!"}},{"$f":"IF(#REF!=\"\",\"\",\"X\")","v":{"$error":"#REF!"}}]
[null,null,null,null,null,null,null,null,null,null,null,null,null,null,null,{"$f":"IF(#REF!=\"\",\"\",IF(#REF!<TODAY(),0,IF(#REF!<(TODAY()+365),1,\"X\")))","v":{"$error":"#REF!"}},{"$f":"IF(#REF!=\"\",\"\",\"X\")","v":{"$error":"#REF!"}}]
[null,null,null,null,null,null,null,null,null,null,null,null,null,null,null,{"$f":"IF(#REF!=\"\",\"\",IF(#REF!<TODAY(),0,IF(#REF!<(TODAY()+365),1,\"X\")))","v":{"$error":"#REF!"}},{"$f":"IF(#REF!=\"\",\"\",\"X\")","v":{"$error":"#REF!"}}]
[null,null,null,null,null,null,null,null,null,null,null,null,null,null,null,{"$f":"IF(#REF!=\"\",\"\",IF(#REF!<TODAY(),0,IF(#REF!<(TODAY()+365),1,\"X\")))","v":{"$error":"#REF!"}},{"$f":"IF(#REF!=\"\",\"\",\"X\")","v":{"$error":"#REF!"}}]
[null,null,null,null,null,null,null,null,null,null,null,null,null,null,null,{"$f":"IF(#REF!=\"\",\"\",IF(#REF!<TODAY(),0,IF(#REF!<(TODAY()+365),1,\"X\")))","v":{"$error":"#REF!"}},{"$f":"IF(#REF!=\"\",\"\",\"X\")","v":{"$error":"#REF!"}}]
[null,null,null,null,null,null,null,null,null,null,null,null,null,null,null,{"$f":"IF(#REF!=\"\",\"\",IF(#REF!<TODAY(),0,IF(#REF!<(TODAY()+365),1,\"X\")))","v":{"$error":"#REF!"}},{"$f":"IF(#REF!=\"\",\"\",\"X\")","v":{"$error":"#REF!"}}]
[null,null,null,null,null,null,null,null,null,null,null,null,null,null,null,{"$f":"IF(#REF!=\"\",\"\",IF(#REF!<TODAY(),0,IF(#REF!<(TODAY()+365),1,\"X\")))","v":{"$error":"#REF!"}},{"$f":"IF(#REF!=\"\",\"\",\"X\")","v":{"$error":"#REF!"}}]
[null,null,null,null,null,null,null,null,null,null,null,null,null,null,null,{"$f":"IF(#REF!=\"\",\"\",IF(#REF!<TODAY(),0,IF(#REF!<(TODAY()+365),1,\"X\")))","v":{"$error":"#REF!"}},{"$f":"IF(#REF!=\"\",\"\",\"X\")","v":{"$error":"#REF!"}}]
[null,null,null,null,null,null,null,null,null,null,null,null,null,null,null,{"$f":"IF(#REF!=\"\",\"\",IF(#REF!<TODAY(),0,IF(#REF!<(TODAY()+365),1,\"X\")))","v":{"$error":"#REF!"}},{"$f":"IF(#REF!=\"\",\"\",\"X\")","v":{"$error":"#REF!"}}]
[null,null,null,null,null,null,null,null,null,null,null,null,null,null,null,{"$f":"IF(#REF!=\"\",\"\",IF(#REF!<TODAY(),0,IF(#REF!<(TODAY()+365),1,\"X\")))","v":{"$error":"#REF!"}},{"$f":"IF(#REF!=\"\",\"\",\"X\")","v":{"$error":"#REF!"}}]
[null,null,null,null,null,null,null,null,null,null,null,null,null,null,null,{"$f":"IF(#REF!=\"\",\"\",IF(#REF!<TODAY(),0,IF(#REF!<(TODAY()+365),1,\"X\")))","v":{"$error":"#REF!"}},{"$f":"IF(#REF!=\"\",\"\",\"X\")","v":{"$error":"#REF!"}}]
[null,null,null,null,null,null,null,null,null,null,null,null,null,null,null,{"$f":"IF(#REF!=\"\",\"\",IF(#REF!<TODAY(),0,IF(#REF!<(TODAY()+365),1,\"X\")))","v":{"$error":"#REF!"}},{"$f":"IF(#REF!=\"\",\"\",\"X\")","v":{"$error":"#REF!"}}]
[null,null,null,null,null,null,null,null,null,null,null,null,null,null,null,{"$f":"IF(#REF!=\"\",\"\",IF(#REF!<TODAY(),0,IF(#REF!<(TODAY()+365),1,\"X\")))","v":{"$error":"#REF!"}},{"$f":"IF(#REF!=\"\",\"\",\"X\")","v":{"$error":"#REF!"}}]
[null,null,null,null,null,null,null,null,null,null,null,null,null,null,null,{"$f":"IF(#REF!=\"\",\"\",IF(#REF!<TODAY(),0,IF(#REF!<(TODAY()+365),1,\"X\")))","v":{"$error":"#REF!"}},{"$f":"IF(#REF!=\"\",\"\",\"X\")","v":{"$error":"#REF!"}}]
[null,null,null,null,null,null,null,null,null,null,null,null,null,null,null,{"$f":"IF(#REF!=\"\",\"\",IF(#REF!<TODAY(),0,IF(#REF!<(TODAY()+365),1,\"X\")))","v":{"$error":"#REF!"}},{"$f":"IF(#REF!=\"\",\"\",\"X\")","v":{"$error":"#REF!"}}]
[null,null,null,null,null,null,null,null,null,null,null,null,null,null,null,{"$f":"IF(#REF!=\"\",\"\",IF(#REF!<TODAY(),0,IF(#REF!<(TODAY()+365),1,\"X\")))","v":{"$error":"#REF!"}},{"$f":"IF(#REF!=\"\",\"\",\"X\")","v":{"$error":"#REF!"}}]
[null,null,null,null,null,null,null,null,null,null,null,null,null,null,null,{"$f":"IF(#REF!=\"\",\"\",IF(#REF!<TODAY(),0,IF(#REF!<(TODAY()+365),1,\"X\")))","v":{"$error":"#REF!"}},{"$f":"IF(#REF!=\"\",\"\",\"X\")","v":{"$error":"#REF!"}}]
[null,null,null,null,null,null,null,null,null,null,null,null,null,null,null,{"$f":"IF(#REF!=\"\",\"\",IF(#REF!<TODAY(),0,IF(#REF!<(TODAY()+365),1,\"X\")))","v":{"$error":"#REF!"}},{"$f":"IF(#REF!=\"\",\"\",\"X\")","v":{"$error":"#REF!"}}]
[null,null,null,null,null,null,null,null,null,null,null,null,null,null,null,{"$f":"IF(#REF!=\"\",\"\",IF(#REF!<TODAY(),0,IF(#REF!<(TODAY()+365),1,\"X\")))","v":{"$error":"#REF!"}},{"$f":"IF(#REF!=\"\",\"\",\"X\")","v":{"$error":"#REF!"}}]
[null,null,null,null,null,null,null,null,null,null,null,null,null,null,null,{"$f":"IF(#REF!=\"\",\"\",IF(#REF!<TODAY(),0,IF(#REF!<(TODAY()+365),1,\"X\")))","v":{"$error":"#REF!"}},{"$f":"IF(#REF!=\"\",\"\",\"X\")","v":{"$error":"#REF!"}}]
[null,null,null,null,null,null,null,null,null,null,null,null,null,null,null,{"$f":"IF(#REF!=\"\",\"\",IF(#REF!<TODAY(),0,IF(#REF!<(TODAY()+365),1,\"X\")))","v":{"$error":"#REF!"}},{"$f":"IF(#REF!=\"\",\"\",\"X\")","v":{"$error":"#REF!"}}]
[null,null,null,null,null,null,null,null,null,null,null,null,null,null,null,{"$f":"IF(#REF!=\"\",\"\",IF(#REF!<TODAY(),0,IF(#REF!<(TODAY()+365),1,\"X\")))","v":{"$error":"#REF!"}},{"$f":"IF(#REF!=\"\",\"\",\"X\")","v":{"$error":"#REF!"}}]
[null,null,null,null,null,null,null,null,null,null,null,null,null,null,null,{"$f":"IF(#REF!=\"\",\"\",IF(#REF!<TODAY(),0,IF(#REF!<(TODAY()+365),1,\"X\")))","v":{"$error":"#REF!"}},{"$f":"IF(#REF!=\"\",\"\",\"X\")","v":{"$error":"#REF!"}}]
[null,null,null,null,null,null,null,null,null,null,null,null,null,null,null,{"$f":"IF(#REF!=\"\",\"\",IF(#REF!<TODAY(),0,IF(#REF!<(TODAY()+365),1,\"X\")))","v":{"$error":"#REF!"}},{"$f":"IF(#REF!=\"\",\"\",\"X\")","v":{"$error":"#REF!"}}]
[null,null,null,null,null,null,null,null,null,null,null,null,null,null,null,{"$f":"IF(#REF!=\"\",\"\",IF(#REF!<TODAY(),0,IF(#REF!<(TODAY()+365),1,\"X\")))","v":{"$error":"#REF!"}},{"$f":"IF(#REF!=\"\",\"\",\"X\")","v":{"$error":"#REF!"}}]
[null,null,null,null,null,null,null,null,null,null,null,null,null,null,null,{"$f":"IF(#REF!=\"\",\"\",IF(#REF!<TODAY(),0,IF(#REF!<(TODAY()+365),1,\"X\")))","v":{"$error":"#REF!"}},{"$f":"IF(#REF!=\"\",\"\",\"X\")","v":{"$error":"#REF!"}}]
[null,null,null,null,null,null,null,null,null,null,null,null,null,null,null,{"$f":"IF(#REF!=\"\",\"\",IF(#REF!<TODAY(),0,IF(#REF!<(TODAY()+365),1,\"X\")))","v":{"$error":"#REF!"}},{"$f":"IF(#REF!=\"\",\"\",\"X\")","v":{"$error":"#REF!"}}]
[null,null,null,null,null,null,null,null,null,null,null,null,null,null,null,{"$f":"IF(#REF!=\"\",\"\",IF(#REF!<TODAY(),0,IF(#REF!<(TODAY()+365),1,\"X\")))","v":{"$error":"#REF!"}},{"$f":"IF(#REF!=\"\",\"\",\"X\")","v":{"$error":"#REF!"}}]
[null,null,null,null,null,null,null,null,null,null,null,null,null,null,null,{"$f":"IF(#REF!=\"\",\"\",IF(#REF!<TODAY(),0,IF(#REF!<(TODAY()+365),1,\"X\")))","v":{"$error":"#REF!"}},{"$f":"IF(#REF!=\"\",\"\",\"X\")","v":{"$error":"#REF!"}}]
[null,null,null,null,null,null,null,null,null,null,null,null,null,null,null,{"$f":"IF(#REF!=\"\",\"\",IF(#REF!<TODAY(),0,IF(#REF!<(TODAY()+365),1,\"X\")))","v":{"$error":"#REF!"}},{"$f":"IF(#REF!=\"\",\"\",\"X\")","v":{"$error":"#REF!"}}]
[null,null,null,null,null,null,null,null,null,null,null,null,null,null,null,{"$f":"IF(#REF!=\"\",\"\",IF(#REF!<TODAY(),0,IF(#REF!<(TODAY()+365),1,\"X\")))","v":{"$error":"#REF!"}},{"$f":"IF(#REF!=\"\",\"\",\"X\")","v":{"$error":"#REF!"}}]
[null,null,null,null,null,null,null,null,null,null,null,null,null,null,null,{"$f":"IF(#REF!=\"\",\"\",IF(#REF!<TODAY(),0,IF(#REF!<(TODAY()+365),1,\"X\")))","v":{"$error":"#REF!"}},{"$f":"IF(#REF!=\"\",\"\",\"X\")","v":{"$error":"#REF!"}}]
[null,null,null,null,null,null,null,null,null,null,null,null,null,null,null,{"$f":"IF(#REF!=\"\",\"\",IF(#REF!<TODAY(),0,IF(#REF!<(TODAY()+365),1,\"X\")))","v":{"$error":"#REF!"}},{"$f":"IF(#REF!=\"\",\"\",\"X\")","v":{"$error":"#REF!"}}]
[null,null,null,null,null,null,null,null,null,null,null,null,null,null,null,{"$f":"IF(#REF!=\"\",\"\",IF(#REF!<TODAY(),0,IF(#REF!<(TODAY()+365),1,\"X\")))","v":{"$error":"#REF!"}},{"$f":"IF(#REF!=\"\",\"\",\"X\")","v":{"$error":"#REF!"}}]
[null,null,null,null,null,null,null,null,null,null,null,null,null,null,null,{"$f":"IF(#REF!=\"\",\"\",IF(#REF!<TODAY(),0,IF(#REF!<(TODAY()+365),1,\"X\")))","v":{"$error":"#REF!"}},{"$f":"IF(#REF!=\"\",\"\",\"X\")","v":{"$error":"#REF!"}}]
[null,null,null,null,null,null,null,null,null,null,null,null,null,null,null,{"$f":"IF(#REF!=\"\",\"\",IF(#REF!<TODAY(),0,IF(#REF!<(TODAY()+365),1,\"X\")))","v":{"$error":"#REF!"}},{"$f":"IF(#REF!=\"\",\"\",\"X\")","v":{"$error":"#REF!"}}]
[null,null,null,null,null,null,null,null,null,null,null,null,null,null,null,{"$f":"IF(#REF!=\"\",\"\",IF(#REF!<TODAY(),0,IF(#REF!<(TODAY()+365),1,\"X\")))","v":{"$error":"#REF!"}},{"$f":"IF(#REF!=\"\",\"\",\"X\")","v":{"$error":"#REF!"}}]
[null,null,null,null,null,null,null,null,null,null,null,null,null,null,null,{"$f":"IF(#REF!=\"\",\"\",IF(#REF!<TODAY(),0,IF(#REF!<(TODAY()+365),1,\"X\")))","v":{"$error":"#REF!"}},{"$f":"IF(#REF!=\"\",\"\",\"X\")","v":{"$error":"#REF!"}}]
[null,null,null,null,null,null,null,null,null,null,null,null,null,null,null,{"$f":"IF(#REF!=\"\",\"\",IF(#REF!<TODAY(),0,IF(#REF!<(TODAY()+365),1,\"X\")))","v":{"$error":"#REF!"}},{"$f":"IF(#REF!=\"\",\"\",\"X\")","v":{"$error":"#REF!"}}]
[null,null,null,null,null,null,null,null,null,null,null,null,null,null,null,{"$f":"IF(#REF!=\"\",\"\",IF(#REF!<TODAY(),0,IF(#REF!<(TODAY()+365),1,\"X\")))","v":{"$error":"#REF!"}},{"$f":"IF(#REF!=\"\",\"\",\"X\")","v":{"$error":"#REF!"}}]
[null,null,null,null,null,null,null,null,null,null,null,null,null,null,null,{"$f":"IF(#REF!=\"\",\"\",IF(#REF!<TODAY(),0,IF(#REF!<(TODAY()+365),1,\"X\")))","v":{"$error":"#REF!"}},{"$f":"IF(#REF!=\"\",\"\",\"X\")","v":{"$error":"#REF!"}}]
[null,null,null,null,null,null,null,null,null,null,null,null,null,null,null,{"$f":"IF(#REF!=\"\",\"\",IF(#REF!<TODAY(),0,IF(#REF!<(TODAY()+365),1,\"X\")))","v":{"$error":"#REF!"}},{"$f":"IF(#REF!=\"\",\"\",\"X\")","v":{"$error":"#REF!"}}]
[null,null,null,null,null,null,null,null,null,null,null,null,null,null,null,{"$f":"IF(#REF!=\"\",\"\",IF(#REF!<TODAY(),0,IF(#REF!<(TODAY()+365),1,\"X\")))","v":{"$error":"#REF!"}},{"$f":"IF(#REF!=\"\",\"\",\"X\")","v":{"$error":"#REF!"}}]
[null,null,null,null,null,null,null,null,null,null,null,null,null,null,null,{"$f":"IF(#REF!=\"\",\"\",IF(#REF!<TODAY(),0,IF(#REF!<(TODAY()+365),1,\"X\")))","v":{"$error":"#REF!"}},{"$f":"IF(#REF!=\"\",\"\",\"X\")","v":{"$error":"#REF!"}}]
[null,null,null,null,null,null,null,null,null,null,null,null,null,null,null,{"$f":"IF(#REF!=\"\",\"\",IF(#REF!<TODAY(),0,IF(#REF!<(TODAY()+365),1,\"X\")))","v":{"$error":"#REF!"}},{"$f":"IF(#REF!=\"\",\"\",\"X\")","v":{"$error":"#REF!"}}]
[null,null,null,null,null,null,null,null,null,null,null,null,null,null,null,{"$f":"IF(#REF!=\"\",\"\",IF(#REF!<TODAY(),0,IF(#REF!<(TODAY()+365),1,\"X\")))","v":{"$error":"#REF!"}},{"$f":"IF(#REF!=\"\",\"\",\"X\")","v":{"$error":"#REF!"}}]
[null,null,null,null,null,null,null,null,null,null,null,null,null,null,null,{"$f":"IF(#REF!=\"\",\"\",IF(#REF!<TODAY(),0,IF(#REF!<(TODAY()+365),1,\"X\")))","v":{"$error":"#REF!"}},{"$f":"IF(#REF!=\"\",\"\",\"X\")","v":{"$error":"#REF!"}}]
[null,null,null,null,null,null,null,null,null,null,null,null,null,null,null,{"$f":"IF(#REF!=\"\",\"\",IF(#REF!<TODAY(),0,IF(#REF!<(TODAY()+365),1,\"X\")))","v":{"$error":"#REF!"}},{"$f":"IF(#REF!=\"\",\"\",\"X\")","v":{"$error":"#REF!"}}]
[null,null,null,null,null,null,null,null,null,null,null,null,null,null,null,{"$f":"IF(#REF!=\"\",\"\",IF(#REF!<TODAY(),0,IF(#REF!<(TODAY()+365),1,\"X\")))","v":{"$error":"#REF!"}},{"$f":"IF(#REF!=\"\",\"\",\"X\")","v":{"$error":"#REF!"}}]
[null,null,null,null,null,null,null,null,null,null,null,null,null,null,null,{"$f":"IF(#REF!=\"\",\"\",IF(#REF!<TODAY(),0,IF(#REF!<(TODAY()+365),1,\"X\")))","v":{"$error":"#REF!"}},{"$f":"IF(#REF!=\"\",\"\",\"X\")","v":{"$error":"#REF!"}}]
[null,null,null,null,null,null,null,null,null,null,null,null,null,null,null,{"$f":"IF(#REF!=\"\",\"\",IF(#REF!<TODAY(),0,IF(#REF!<(TODAY()+365),1,\"X\")))","v":{"$error":"#REF!"}},{"$f":"IF(#REF!=\"\",\"\",\"X\")","v":{"$error":"#REF!"}}]
[null,null,null,null,null,null,null,null,null,null,null,null,null,null,null,{"$f":"IF(#REF!=\"\",\"\",IF(#REF!<TODAY(),0,IF(#REF!<(TODAY()+365),1,\"X\")))","v":{"$error":"#REF!"}},{"$f":"IF(#REF!=\"\",\"\",\"X\")","v":{"$error":"#REF!"}}]
[null,null,null,null,null,null,null,null,null,null,null,null,null,null,null,{"$f":"IF(#REF!=\"\",\"\",IF(#REF!<TODAY(),0,IF(#REF!<(TODAY()+365),1,\"X\")))","v":{"$error":"#REF!"}},{"$f":"IF(#REF!=\"\",\"\",\"X\")","v":{"$error":"#REF!"}}]
[null,null,null,null,null,null,null,null,null,null,null,null,null,null,null,{"$f":"IF(#REF!=\"\",\"\",IF(#REF!<TODAY(),0,IF(#REF!<(TODAY()+365),1,\"X\")))","v":{"$error":"#REF!"}},{"$f":"IF(#REF!=\"\",\"\",\"X\")","v":{"$error":"#REF!"}}]
[null,null,null,null,null,null,null,null,null,null,null,null,null,null,null,{"$f":"IF(#REF!=\"\",\"\",IF(#REF!<TODAY(),0,IF(#REF!<(TODAY()+365),1,\"X\")))","v":{"$error":"#REF!"}},{"$f":"IF(#REF!=\"\",\"\",\"X\")","v":{"$error":"#REF!"}}]
[null,null,null,null,null,null,null,null,null,null,null,null,null,null,null,{"$f":"IF(#REF!=\"\",\"\",IF(#REF!<TODAY(),0,IF(#REF!<(TODAY()+365),1,\"X\")))","v":{"$error":"#REF!"}},{"$f":"IF(#REF!=\"\",\"\",\"X\")","v":{"$error":"#REF!"}}]
[null,null,null,null,null,null,null,null,null,null,null,null,null,null,null,{"$f":"IF(#REF!=\"\",\"\",IF(#REF!<TODAY(),0,IF(#REF!<(TODAY()+365),1,\"X\")))","v":{"$error":"#REF!"}},{"$f":"IF(#REF!=\"\",\"\",\"X\")","v":{"$error":"#REF!"}}]
[null,null,null,null,null,null,null,null,null,null,null,null,null,null,null,{"$f":"IF(#REF!=\"\",\"\",IF(#REF!<TODAY(),0,IF(#REF!<(TODAY()+365),1,\"X\")))","v":{"$error":"#REF!"}},{"$f":"IF(#REF!=\"\",\"\",\"X\")","v":{"$error":"#REF!"}}]
[null,null,null,null,null,null,null,null,null,null,null,null,null,null,null,{"$f":"IF(#REF!=\"\",\"\",IF(#REF!<TODAY(),0,IF(#REF!<(TODAY()+365),1,\"X\")))","v":{"$error":"#REF!"}},{"$f":"IF(#REF!=\"\",\"\",\"X\")","v":{"$error":"#REF!"}}]
[null,null,null,null,null,null,null,null,null,null,null,null,null,null,null,{"$f":"IF(#REF!=\"\",\"\",IF(#REF!<TODAY(),0,IF(#REF!<(TODAY()+365),1,\"X\")))","v":{"$error":"#REF!"}},{"$f":"IF(#REF!=\"\",\"\",\"X\")","v":{"$error":"#REF!"}}]
[null,null,null,null,null,null,null,null,null,null,null,null,null,null,null,{"$f":"IF(#REF!=\"\",\"\",IF(#REF!<TODAY(),0,IF(#REF!<(TODAY()+365),1,\"X\")))","v":{"$error":"#REF!"}},{"$f":"IF(#REF!=\"\",\"\",\"X\")","v":{"$error":"#REF!"}}]
[null,null,null,null,null,null,null,null,null,null,null,null,null,null,null,{"$f":"IF(#REF!=\"\",\"\",IF(#REF!<TODAY(),0,IF(#REF!<(TODAY()+365),1,\"X\")))","v":{"$error":"#REF!"}},{"$f":"IF(#REF!=\"\",\"\",\"X\")","v":{"$error":"#REF!"}}]
[null,null,null,null,null,null,null,null,null,null,null,null,null,null,null,{"$f":"IF(#REF!=\"\",\"\",IF(#REF!<TODAY(),0,IF(#REF!<(TODAY()+365),1,\"X\")))","v":{"$error":"#REF!"}},{"$f":"IF(#REF!=\"\",\"\",\"X\")","v":{"$error":"#REF!"}}]
[null,null,null,null,null,null,null,null,null,null,null,null,null,null,null,{"$f":"IF(#REF!=\"\",\"\",IF(#REF!<TODAY(),0,IF(#REF!<(TODAY()+365),1,\"X\")))","v":{"$error":"#REF!"}},{"$f":"IF(#REF!=\"\",\"\",\"X\")","v":{"$error":"#REF!"}}]
[null,null,null,null,null,null,null,null,null,null,null,null,null,null,null,{"$f":"IF(#REF!=\"\",\"\",IF(#REF!<TODAY(),0,IF(#REF!<(TODAY()+365),1,\"X\")))","v":{"$error":"#REF!"}},{"$f":"IF(#REF!=\"\",\"\",\"X\")","v":{"$error":"#REF!"}}]
[null,null,null,null,null,null,null,null,null,null,null,null,null,null,null,{"$f":"IF(#REF!=\"\",\"\",IF(#REF!<TODAY(),0,IF(#REF!<(TODAY()+365),1,\"X\")))","v":{"$error":"#REF!"}},{"$f":"IF(#REF!=\"\",\"\",\"X\")","v":{"$error":"#REF!"}}]
[null,null,null,null,null,null,null,null,null,null,null,null,null,null,null,{"$f":"IF(#REF!=\"\",\"\",IF(#REF!<TODAY(),0,IF(#REF!<(TODAY()+365),1,\"X\")))","v":{"$error":"#REF!"}},{"$f":"IF(#REF!=\"\",\"\",\"X\")","v":{"$error":"#REF!"}}]
[null,null,null,null,null,null,null,null,null,null,null,null,null,null,null,{"$f":"IF(#REF!=\"\",\"\",IF(#REF!<TODAY(),0,IF(#REF!<(TODAY()+365),1,\"X\")))","v":{"$error":"#REF!"}},{"$f":"IF(#REF!=\"\",\"\",\"X\")","v":{"$error":"#REF!"}}]
[null,null,null,null,null,null,null,null,null,null,null,null,null,null,null,{"$f":"IF(#REF!=\"\",\"\",IF(#REF!<TODAY(),0,IF(#REF!<(TODAY()+365),1,\"X\")))","v":{"$error":"#REF!"}},{"$f":"IF(#REF!=\"\",\"\",\"X\")","v":{"$error":"#REF!"}}]
[null,null,null,null,null,null,null,null,null,null,null,null,null,null,null,{"$f":"IF(#REF!=\"\",\"\",IF(#REF!<TODAY(),0,IF(#REF!<(TODAY()+365),1,\"X\")))","v":{"$error":"#REF!"}},{"$f":"IF(#REF!=\"\",\"\",\"X\")","v":{"$error":"#REF!"}}]
[null,null,null,null,null,null,null,null,null,null,null,null,null,null,null,{"$f":"IF(#REF!=\"\",\"\",IF(#REF!<TODAY(),0,IF(#REF!<(TODAY()+365),1,\"X\")))","v":{"$error":"#REF!"}},{"$f":"IF(#REF!=\"\",\"\",\"X\")","v":{"$error":"#REF!"}}]
[null,null,null,null,null,null,null,null,null,null,null,null,null,null,null,{"$f":"IF(#REF!=\"\",\"\",IF(#REF!<TODAY(),0,IF(#REF!<(TODAY()+365),1,\"X\")))","v":{"$error":"#REF!"}},{"$f":"IF(#REF!=\"\",\"\",\"X\")","v":{"$error":"#REF!"}}]
[null,null,null,null,null,null,null,null,null,null,null,null,null,null,null,{"$f":"IF(#REF!=\"\",\"\",IF(#REF!<TODAY(),0,IF(#REF!<(TODAY()+365),1,\"X\")))","v":{"$error":"#REF!"}},{"$f":"IF(#REF!=\"\",\"\",\"X\")","v":{"$error":"#REF!"}}]
[null,null,null,null,null,null,null,null,null,null,null,null,null,null,null,{"$f":"IF(#REF!=\"\",\"\",IF(#REF!<TODAY(),0,IF(#REF!<(TODAY()+365),1,\"X\")))","v":{"$error":"#REF!"}},{"$f":"IF(#REF!=\"\",\"\",\"X\")","v":{"$error":"#REF!"}}]
[null,null,null,null,null,null,null,null,null,null,null,null,null,null,null,{"$f":"IF(#REF!=\"\",\"\",IF(#REF!<TODAY(),0,IF(#REF!<(TODAY()+365),1,\"X\")))","v":{"$error":"#REF!"}},{"$f":"IF(#REF!=\"\",\"\",\"X\")","v":{"$error":"#REF!"}}]
[null,null,null,null,null,null,null,null,null,null,null,null,null,null,null,{"$f":"IF(#REF!=\"\",\"\",IF(#REF!<TODAY(),0,IF(#REF!<(TODAY()+365),1,\"X\")))","v":{"$error":"#REF!"}},{"$f":"IF(#REF!=\"\",\"\",\"X\")","v":{"$error":"#REF!"}}]
[null,null,null,null,null,null,null,null,null,null,null,null,null,null,null,{"$f":"IF(#REF!=\"\",\"\",IF(#REF!<TODAY(),0,IF(#REF!<(TODAY()+365),1,\"X\")))","v":{"$error":"#REF!"}},{"$f":"IF(#REF!=\"\",\"\",\"X\")","v":{"$error":"#REF!"}}]
[null,null,null,null,null,null,null,null,null,null,null,null,null,null,null,{"$f":"IF(#REF!=\"\",\"\",IF(#REF!<TODAY(),0,IF(#REF!<(TODAY()+365),1,\"X\")))","v":{"$error":"#REF!"}},{"$f":"IF(#REF!=\"\",\"\",\"X\")","v":{"$error":"#REF!"}}]
[null,null,null,null,null,null,null,null,null,null,null,null,null,null,null,{"$f":"IF(#REF!=\"\",\"\",IF(#REF!<TODAY(),0,IF(#REF!<(TODAY()+365),1,\"X\")))","v":{"$error":"#REF!"}},{"$f":"IF(#REF!=\"\",\"\",\"X\")","v":{"$error":"#REF!"}}]
[null,null,null,null,null,null,null,null,null,null,null,null,null,null,null,{"$f":"IF(#REF!=\"\",\"\",IF(#REF!<TODAY(),0,IF(#REF!<(TODAY()+365),1,\"X\")))","v":{"$error":"#REF!"}},{"$f":"IF(#REF!=\"\",\"\",\"X\")","v":{"$error":"#REF!"}}]
[null,null,null,null,null,null,null,null,null,null,null,null,null,null,null,{"$f":"IF(#REF!=\"\",\"\",IF(#REF!<TODAY(),0,IF(#REF!<(TODAY()+365),1,\"X\")))","v":{"$error":"#REF!"}},{"$f":"IF(#REF!=\"\",\"\",\"X\")","v":{"$error":"#REF!"}}]
[null,null,null,null,null,null,null,null,null,null,null,null,null,null,null,{"$f":"IF(#REF!=\"\",\"\",IF(#REF!<TODAY(),0,IF(#REF!<(TODAY()+365),1,\"X\")))","v":{"$error":"#REF!"}},{"$f":"IF(#REF!=\"\",\"\",\"X\")","v":{"$error":"#REF!"}}]
[null,null,null,null,null,null,null,null,null,null,null,null,null,null,null,{"$f":"IF(#REF!=\"\",\"\",IF(#REF!<TODAY(),0,IF(#REF!<(TODAY()+365),1,\"X\")))","v":{"$error":"#REF!"}},{"$f":"IF(#REF!=\"\",\"\",\"X\")","v":{"$error":"#REF!"}}]
[null,null,null,null,null,null,null,null,null,null,null,null,null,null,null,{"$f":"IF(#REF!=\"\",\"\",IF(#REF!<TODAY(),0,IF(#REF!<(TODAY()+365),1,\"X\")))","v":{"$error":"#REF!"}},{"$f":"IF(#REF!=\"\",\"\",\"X\")","v":{"$error":"#REF!"}}]
[null,null,null,null,null,null,null,null,null,null,null,null,null,null,null,{"$f":"IF(#REF!=\"\",\"\",IF(#REF!<TODAY(),0,IF(#REF!<(TODAY()+365),1,\"X\")))","v":{"$error":"#REF!"}},{"$f":"IF(#REF!=\"\",\"\",\"X\")","v":{"$error":"#REF!"}}]
[null,null,null,null,null,null,null,null,null,null,null,null,null,null,null,{"$f":"IF(#REF!=\"\",\"\",IF(#REF!<TODAY(),0,IF(#REF!<(TODAY()+365),1,\"X\")))","v":{"$error":"#REF!"}},{"$f":"IF(#REF!=\"\",\"\",\"X\")","v":{"$error":"#REF!"}}]
[null,null,null,null,null,null,null,null,null,null,null,null,null,null,null,{"$f":"IF(#REF!=\"\",\"\",IF(#REF!<TODAY(),0,IF(#REF!<(TODAY()+365),1,\"X\")))","v":{"$error":"#REF!"}},{"$f":"IF(#REF!=\"\",\"\",\"X\")","v":{"$error":"#REF!"}}]
[null,null,null,null,null,null,null,null,null,null,null,null,null,null,null,{"$f":"IF(#REF!=\"\",\"\",IF(#REF!<TODAY(),0,IF(#REF!<(TODAY()+365),1,\"X\")))","v":{"$error":"#REF!"}},{"$f":"IF(#REF!=\"\",\"\",\"X\")","v":{"$error":"#REF!"}}]
[null,null,null,null,null,null,null,null,null,null,null,null,null,null,null,{"$f":"IF(#REF!=\"\",\"\",IF(#REF!<TODAY(),0,IF(#REF!<(TODAY()+365),1,\"X\")))","v":{"$error":"#REF!"}},{"$f":"IF(#REF!=\"\",\"\",\"X\")","v":{"$error":"#REF!"}}]
[null,null,null,null,null,null,null,null,null,null,null,null,null,null,null,{"$f":"IF(#REF!=\"\",\"\",IF(#REF!<TODAY(),0,IF(#REF!<(TODAY()+365),1,\"X\")))","v":{"$error":"#REF!"}},{"$f":"IF(#REF!=\"\",\"\",\"X\")","v":{"$error":"#REF!"}}]
[null,null,null,null,null,null,null,null,null,null,null,null,null,null,null,{"$f":"IF(#REF!=\"\",\"\",IF(#REF!<TODAY(),0,IF(#REF!<(TODAY()+365),1,\"X\")))","v":{"$error":"#REF!"}},{"$f":"IF(#REF!=\"\",\"\",\"X\")","v":{"$error":"#REF!"}}]
[null,null,null,null,null,null,null,null,null,null,null,null,null,null,null,{"$f":"IF(#REF!=\"\",\"\",IF(#REF!<TODAY(),0,IF(#REF!<(TODAY()+365),1,\"X\")))","v":{"$error":"#REF!"}},{"$f":"IF(#REF!=\"\",\"\",\"X\")","v":{"$error":"#REF!"}}]
[null,null,null,null,null,null,null,null,null,null,null,null,null,null,null,{"$f":"IF(#REF!=\"\",\"\",IF(#REF!<TODAY(),0,IF(#REF!<(TODAY()+365),1,\"X\")))","v":{"$error":"#REF!"}},{"$f":"IF(#REF!=\"\",\"\",\"X\")","v":{"$error":"#REF!"}}]
[null,null,null,null,null,null,null,null,null,null,null,null,null,null,null,{"$f":"IF(#REF!=\"\",\"\",IF(#REF!<TODAY(),0,IF(#REF!<(TODAY()+365),1,\"X\")))","v":{"$error":"#REF!"}},{"$f":"IF(#REF!=\"\",\"\",\"X\")","v":{"$error":"#REF!"}}]
[null,null,null,null,null,null,null,null,null,null,null,null,null,null,null,{"$f":"IF(#REF!=\"\",\"\",IF(#REF!<TODAY(),0,IF(#REF!<(TODAY()+365),1,\"X\")))","v":{"$error":"#REF!"}},{"$f":"IF(#REF!=\"\",\"\",\"X\")","v":{"$error":"#REF!"}}]
[null,null,null,null,null,null,null,null,null,null,null,null,null,null,null,{"$f":"IF(#REF!=\"\",\"\",IF(#REF!<TODAY(),0,IF(#REF!<(TODAY()+365),1,\"X\")))","v":{"$error":"#REF!"}},{"$f":"IF(#REF!=\"\",\"\",\"X\")","v":{"$error":"#REF!"}}]
[null,null,null,null,null,null,null,null,null,null,null,null,null,null,null,{"$f":"IF(#REF!=\"\",\"\",IF(#REF!<TODAY(),0,IF(#REF!<(TODAY()+365),1,\"X\")))","v":{"$error":"#REF!"}},{"$f":"IF(#REF!=\"\",\"\",\"X\")","v":{"$error":"#REF!"}}]
[null,null,null,null,null,null,null,null,null,null,null,null,null,null,null,{"$f":"IF(#REF!=\"\",\"\",IF(#REF!<TODAY(),0,IF(#REF!<(TODAY()+365),1,\"X\")))","v":{"$error":"#REF!"}},{"$f":"IF(#REF!=\"\",\"\",\"X\")","v":{"$error":"#REF!"}}]
[null,null,null,null,null,null,null,null,null,null,null,null,null,null,null,{"$f":"IF(#REF!=\"\",\"\",IF(#REF!<TODAY(),0,IF(#REF!<(TODAY()+365),1,\"X\")))","v":{"$error":"#REF!"}},{"$f":"IF(#REF!=\"\",\"\",\"X\")","v":{"$error":"#REF!"}}]
[null,null,null,null,null,null,null,null,null,null,null,null,null,null,null,{"$f":"IF(#REF!=\"\",\"\",IF(#REF!<TODAY(),0,IF(#REF!<(TODAY()+365),1,\"X\")))","v":{"$error":"#REF!"}},{"$f":"IF(#REF!=\"\",\"\",\"X\")","v":{"$error":"#REF!"}}]
[null,null,null,null,null,null,null,null,null,null,null,null,null,null,null,{"$f":"IF(#REF!=\"\",\"\",IF(#REF!<TODAY(),0,IF(#REF!<(TODAY()+365),1,\"X\")))","v":{"$error":"#REF!"}},{"$f":"IF(#REF!=\"\",\"\",\"X\")","v":{"$error":"#REF!"}}]
[null,null,null,null,null,null,null,null,null,null,null,null,null,null,null,{"$f":"IF(#REF!=\"\",\"\",IF(#REF!<TODAY(),0,IF(#REF!<(TODAY()+365),1,\"X\")))","v":{"$error":"#REF!"}},{"$f":"IF(#REF!=\"\",\"\",\"X\")","v":{"$error":"#REF!"}}]
[null,null,null,null,null,null,null,null,null,null,null,null,null,null,null,{"$f":"IF(#REF!=\"\",\"\",IF(#REF!<TODAY(),0,IF(#REF!<(TODAY()+365),1,\"X\")))","v":{"$error":"#REF!"}},{"$f":"IF(#REF!=\"\",\"\",\"X\")","v":{"$error":"#REF!"}}]
[null,null,null,null,null,null,null,null,null,null,null,null,null,null,null,{"$f":"IF(#REF!=\"\",\"\",IF(#REF!<TODAY(),0,IF(#REF!<(TODAY()+365),1,\"X\")))","v":{"$error":"#REF!"}},{"$f":"IF(#REF!=\"\",\"\",\"X\")","v":{"$error":"#REF!"}}]
[null,null,null,null,null,null,null,null,null,null,null,null,null,null,null,{"$f":"IF(#REF!=\"\",\"\",IF(#REF!<TODAY(),0,IF(#REF!<(TODAY()+365),1,\"X\")))","v":{"$error":"#REF!"}},{"$f":"IF(#REF!=\"\",\"\",\"X\")","v":{"$error":"#REF!"}}]
[null,null,null,null,null,null,null,null,null,null,null,null,null,null,null,{"$f":"IF(#REF!=\"\",\"\",IF(#REF!<TODAY(),0,IF(#REF!<(TODAY()+365),1,\"X\")))","v":{"$error":"#REF!"}},{"$f":"IF(#REF!=\"\",\"\",\"X\")","v":{"$error":"#REF!"}}]
[null,null,null,null,null,null,null,null,null,null,null,null,null,null,null,{"$f":"IF(#REF!=\"\",\"\",IF(#REF!<TODAY(),0,IF(#REF!<(TODAY()+365),1,\"X\")))","v":{"$error":"#REF!"}},{"$f":"IF(#REF!=\"\",\"\",\"X\")","v":{"$error":"#REF!"}}]
[null,null,null,null,null,null,null,null,null,null,null,null,null,null,null,{"$f":"IF(#REF!=\"\",\"\",IF(#REF!<TODAY(),0,IF(#REF!<(TODAY()+365),1,\"X\")))","v":{"$error":"#REF!"}},{"$f":"IF(#REF!=\"\",\"\",\"X\")","v":{"$error":"#REF!"}}]
[null,null,null,null,null,null,null,null,null,null,null,null,null,null,null,{"$f":"IF(#REF!=\"\",\"\",IF(#REF!<TODAY(),0,IF(#REF!<(TODAY()+365),1,\"X\")))","v":{"$error":"#REF!"}},{"$f":"IF(#REF!=\"\",\"\",\"X\")","v":{"$error":"#REF!"}}]
[null,null,null,null,null,null,null,null,null,null,null,null,null,null,null,{"$f":"IF(#REF!=\"\",\"\",IF(#REF!<TODAY(),0,IF(#REF!<(TODAY()+365),1,\"X\")))","v":{"$error":"#REF!"}},{"$f":"IF(#REF!=\"\",\"\",\"X\")","v":{"$error":"#REF!"}}]
[null,null,null,null,null,null,null,null,null,null,null,null,null,null,null,{"$f":"IF(#REF!=\"\",\"\",IF(#REF!<TODAY(),0,IF(#REF!<(TODAY()+365),1,\"X\")))","v":{"$error":"#REF!"}},{"$f":"IF(#REF!=\"\",\"\",\"X\")","v":{"$error":"#REF!"}}]
[null,null,null,null,null,null,null,null,null,null,null,null,null,null,null,{"$f":"IF(#REF!=\"\",\"\",IF(#REF!<TODAY(),0,IF(#REF!<(TODAY()+365),1,\"X\")))","v":{"$error":"#REF!"}},{"$f":"IF(#REF!=\"\",\"\",\"X\")","v":{"$error":"#REF!"}}]
[null,null,null,null,null,null,null,null,null,null,null,null,null,null,null,{"$f":"IF(#REF!=\"\",\"\",IF(#REF!<TODAY(),0,IF(#REF!<(TODAY()+365),1,\"X\")))","v":{"$error":"#REF!"}},{"$f":"IF(#REF!=\"\",\"\",\"X\")","v":{"$error":"#REF!"}}]
[null,null,null,null,null,null,null,null,null,null,null,null,null,null,null,{"$f":"IF(#REF!=\"\",\"\",IF(#REF!<TODAY(),0,IF(#REF!<(TODAY()+365),1,\"X\")))","v":{"$error":"#REF!"}},{"$f":"IF(#REF!=\"\",\"\",\"X\")","v":{"$error":"#REF!"}}]
[null,null,null,null,null,null,null,null,null,null,null,null,null,null,null,{"$f":"IF(#REF!=\"\",\"\",IF(#REF!<TODAY(),0,IF(#REF!<(TODAY()+365),1,\"X\")))","v":{"$error":"#REF!"}},{"$f":"IF(#REF!=\"\",\"\",\"X\")","v":{"$error":"#REF!"}}]
[null,null,null,null,null,null,null,null,null,null,null,null,null,null,null,{"$f":"IF(#REF!=\"\",\"\",IF(#REF!<TODAY(),0,IF(#REF!<(TODAY()+365),1,\"X\")))","v":{"$error":"#REF!"}},{"$f":"IF(#REF!=\"\",\"\",\"X\")","v":{"$error":"#REF!"}}]
[null,null,null,null,null,null,null,null,null,null,null,null,null,null,null,{"$f":"IF(#REF!=\"\",\"\",IF(#REF!<TODAY(),0,IF(#REF!<(TODAY()+365),1,\"X\")))","v":{"$error":"#REF!"}},{"$f":"IF(#REF!=\"\",\"\",\"X\")","v":{"$error":"#REF!"}}]
[null,null,null,null,null,null,null,null,null,null,null,null,null,null,null,{"$f":"IF(#REF!=\"\",\"\",IF(#REF!<TODAY(),0,IF(#REF!<(TODAY()+365),1,\"X\")))","v":{"$error":"#REF!"}},{"$f":"IF(#REF!=\"\",\"\",\"X\")","v":{"$error":"#REF!"}}]
[null,null,null,null,null,null,null,null,null,null,null,null,null,null,null,{"$f":"IF(#REF!=\"\",\"\",IF(#REF!<TODAY(),0,IF(#REF!<(TODAY()+365),1,\"X\")))","v":{"$error":"#REF!"}},{"$f":"IF(#REF!=\"\",\"\",\"X\")","v":{"$error":"#REF!"}}]
[null,null,null,null,null,null,null,null,null,null,null,null,null,null,null,{"$f":"IF(#REF!=\"\",\"\",IF(#REF!<TODAY(),0,IF(#REF!<(TODAY()+365),1,\"X\")))","v":{"$error":"#REF!"}},{"$f":"IF(#REF!=\"\",\"\",\"X\")","v":{"$error":"#REF!"}}]
[null,null,null,null,null,null,null,null,null,null,null,null,null,null,null,{"$f":"IF(#REF!=\"\",\"\",IF(#REF!<TODAY(),0,IF(#REF!<(TODAY()+365),1,\"X\")))","v":{"$error":"#REF!"}},{"$f":"IF(#REF!=\"\",\"\",\"X\")","v":{"$error":"#REF!"}}]
[null,null,null,null,null,null,null,null,null,null,null,null,null,null,null,{"$f":"IF(#REF!=\"\",\"\",IF(#REF!<TODAY(),0,IF(#REF!<(TODAY()+365),1,\"X\")))","v":{"$error":"#REF!"}},{"$f":"IF(#REF!=\"\",\"\",\"X\")","v":{"$error":"#REF!"}}]
[null,null,null,null,null,null,null,null,null,null,null,null,null,null,null,{"$f":"IF(#REF!=\"\",\"\",IF(#REF!<TODAY(),0,IF(#REF!<(TODAY()+365),1,\"X\")))","v":{"$error":"#REF!"}},{"$f":"IF(#REF!=\"\",\"\",\"X\")","v":{"$error":"#REF!"}}]
[null,null,null,null,null,null,null,null,null,null,null,null,null,null,null,{"$f":"IF(#REF!=\"\",\"\",IF(#REF!<TODAY(),0,IF(#REF!<(TODAY()+365),1,\"X\")))","v":{"$error":"#REF!"}},{"$f":"IF(#REF!=\"\",\"\",\"X\")","v":{"$error":"#REF!"}}]
[null,null,null,null,null,null,null,null,null,null,null,null,null,null,null,{"$f":"IF(#REF!=\"\",\"\",IF(#REF!<TODAY(),0,IF(#REF!<(TODAY()+365),1,\"X\")))","v":{"$error":"#REF!"}},{"$f":"IF(#REF!=\"\",\"\",\"X\")","v":{"$error":"#REF!"}}]
[null,null,null,null,null,null,null,null,null,null,null,null,null,null,null,{"$f":"IF(#REF!=\"\",\"\",IF(#REF!<TODAY(),0,IF(#REF!<(TODAY()+365),1,\"X\")))","v":{"$error":"#REF!"}},{"$f":"IF(#REF!=\"\",\"\",\"X\")","v":{"$error":"#REF!"}}]
[null,null,null,null,null,null,null,null,null,null,null,null,null,null,null,{"$f":"IF(#REF!=\"\",\"\",IF(#REF!<TODAY(),0,IF(#REF!<(TODAY()+365),1,\"X\")))","v":{"$error":"#REF!"}},{"$f":"IF(#REF!=\"\",\"\",\"X\")","v":{"$error":"#REF!"}}]
[null,null,null,null,null,null,null,null,null,null,null,null,null,null,null,{"$f":"IF(#REF!=\"\",\"\",IF(#REF!<TODAY(),0,IF(#REF!<(TODAY()+365),1,\"X\")))","v":{"$error":"#REF!"}},{"$f":"IF(#REF!=\"\",\"\",\"X\")","v":{"$error":"#REF!"}}]
[null,null,null,null,null,null,null,null,null,null,null,null,null,null,null,{"$f":"IF(#REF!=\"\",\"\",IF(#REF!<TODAY(),0,IF(#REF!<(TODAY()+365),1,\"X\")))","v":{"$error":"#REF!"}},{"$f":"IF(#REF!=\"\",\"\",\"X\")","v":{"$error":"#REF!"}}]
[null,null,null,null,null,null,null,null,null,null,null,null,null,null,null,{"$f":"IF(#REF!=\"\",\"\",IF(#REF!<TODAY(),0,IF(#REF!<(TODAY()+365),1,\"X\")))","v":{"$error":"#REF!"}},{"$f":"IF(#REF!=\"\",\"\",\"X\")","v":{"$error":"#REF!"}}]
[null,null,null,null,null,null,null,null,null,null,null,null,null,null,null,{"$f":"IF(#REF!=\"\",\"\",IF(#REF!<TODAY(),0,IF(#REF!<(TODAY()+365),1,\"X\")))","v":{"$error":"#REF!"}},{"$f":"IF(#REF!=\"\",\"\",\"X\")","v":{"$error":"#REF!"}}]
[null,null,null,null,null,null,null,null,null,null,null,null,null,null,null,{"$f":"IF(#REF!=\"\",\"\",IF(#REF!<TODAY(),0,IF(#REF!<(TODAY()+365),1,\"X\")))","v":{"$error":"#REF!"}},{"$f":"IF(#REF!=\"\",\"\",\"X\")","v":{"$error":"#REF!"}}]
[null,null,null,null,null,null,null,null,null,null,null,null,null,null,null,{"$f":"IF(#REF!=\"\",\"\",IF(#REF!<TODAY(),0,IF(#REF!<(TODAY()+365),1,\"X\")))","v":{"$error":"#REF!"}},{"$f":"IF(#REF!=\"\",\"\",\"X\")","v":{"$error":"#REF!"}}]
[null,null,null,null,null,null,null,null,null,null,null,null,null,null,null,{"$f":"IF(#REF!=\"\",\"\",IF(#REF!<TODAY(),0,IF(#REF!<(TODAY()+365),1,\"X\")))","v":{"$error":"#REF!"}},{"$f":"IF(#REF!=\"\",\"\",\"X\")","v":{"$error":"#REF!"}}]
[null,null,null,null,null,null,null,null,null,null,null,null,null,null,null,{"$f":"IF(#REF!=\"\",\"\",IF(#REF!<TODAY(),0,IF(#REF!<(TODAY()+365),1,\"X\")))","v":{"$error":"#REF!"}},{"$f":"IF(#REF!=\"\",\"\",\"X\")","v":{"$error":"#REF!"}}]
[null,null,null,null,null,null,null,null,null,null,null,null,null,null,null,{"$f":"IF(#REF!=\"\",\"\",IF(#REF!<TODAY(),0,IF(#REF!<(TODAY()+365),1,\"X\")))","v":{"$error":"#REF!"}},{"$f":"IF(#REF!=\"\",\"\",\"X\")","v":{"$error":"#REF!"}}]
[null,null,null,null,null,null,null,null,null,null,null,null,null,null,null,{"$f":"IF(#REF!=\"\",\"\",IF(#REF!<TODAY(),0,IF(#REF!<(TODAY()+365),1,\"X\")))","v":{"$error":"#REF!"}},{"$f":"IF(#REF!=\"\",\"\",\"X\")","v":{"$error":"#REF!"}}]
[null,null,null,null,null,null,null,null,null,null,null,null,null,null,null,{"$f":"IF(#REF!=\"\",\"\",IF(#REF!<TODAY(),0,IF(#REF!<(TODAY()+365),1,\"X\")))","v":{"$error":"#REF!"}},{"$f":"IF(#REF!=\"\",\"\",\"X\")","v":{"$error":"#REF!"}}]
[null,null,null,null,null,null,null,null,null,null,null,null,null,null,null,{"$f":"IF(#REF!=\"\",\"\",IF(#REF!<TODAY(),0,IF(#REF!<(TODAY()+365),1,\"X\")))","v":{"$error":"#REF!"}},{"$f":"IF(#REF!=\"\",\"\",\"X\")","v":{"$error":"#REF!"}}]
[null,null,null,null,null,null,null,null,null,null,null,null,null,null,null,{"$f":"IF(#REF!=\"\",\"\",IF(#REF!<TODAY(),0,IF(#REF!<(TODAY()+365),1,\"X\")))","v":{"$error":"#REF!"}},{"$f":"IF(#REF!=\"\",\"\",\"X\")","v":{"$error":"#REF!"}}]
[null,null,null,null,null,null,null,null,null,null,null,null,null,null,null,{"$f":"IF(#REF!=\"\",\"\",IF(#REF!<TODAY(),0,IF(#REF!<(TODAY()+365),1,\"X\")))","v":{"$error":"#REF!"}},{"$f":"IF(#REF!=\"\",\"\",\"X\")","v":{"$error":"#REF!"}}]
[null,null,null,null,null,null,null,null,null,null,null,null,null,null,null,{"$f":"IF(#REF!=\"\",\"\",IF(#REF!<TODAY(),0,IF(#REF!<(TODAY()+365),1,\"X\")))","v":{"$error":"#REF!"}},{"$f":"IF(#REF!=\"\",\"\",\"X\")","v":{"$error":"#REF!"}}]
[null,null,null,null,null,null,null,null,null,null,null,null,null,null,null,{"$f":"IF(#REF!=\"\",\"\",IF(#REF!<TODAY(),0,IF(#REF!<(TODAY()+365),1,\"X\")))","v":{"$error":"#REF!"}},{"$f":"IF(#REF!=\"\",\"\",\"X\")","v":{"$error":"#REF!"}}]
[null,null,null,null,null,null,null,null,null,null,null,null,null,null,null,{"$f":"IF(#REF!=\"\",\"\",IF(#REF!<TODAY(),0,IF(#REF!<(TODAY()+365),1,\"X\")))","v":{"$error":"#REF!"}},{"$f":"IF(#REF!=\"\",\"\",\"X\")","v":{"$error":"#REF!"}}]
[null,null,null,null,null,null,null,null,null,null,null,null,null,null,null,{"$f":"IF(#REF!=\"\",\"\",IF(#REF!<TODAY(),0,IF(#REF!<(TODAY()+365),1,\"X\")))","v":{"$error":"#REF!"}},{"$f":"IF(#REF!=\"\",\"\",\"X\")","v":{"$error":"#REF!"}}]
[null,null,null,null,null,null,null,null,null,null,null,null,null,null,null,{"$f":"IF(#REF!=\"\",\"\",IF(#REF!<TODAY(),0,IF(#REF!<(TODAY()+365),1,\"X\")))","v":{"$error":"#REF!"}},{"$f":"IF(#REF!=\"\",\"\",\"X\")","v":{"$error":"#REF!"}}]
[null,null,null,null,null,null,null,null,null,null,null,null,null,null,null,{"$f":"IF(#REF!=\"\",\"\",IF(#REF!<TODAY(),0,IF(#REF!<(TODAY()+365),1,\"X\")))","v":{"$error":"#REF!"}},{"$f":"IF(#REF!=\"\",\"\",\"X\")","v":{"$error":"#REF!"}}]
[null,null,null,null,null,null,null,null,null,null,null,null,null,null,null,{"$f":"IF(#REF!=\"\",\"\",IF(#REF!<TODAY(),0,IF(#REF!<(TODAY()+365),1,\"X\")))","v":{"$error":"#REF!"}},{"$f":"IF(#REF!=\"\",\"\",\"X\")","v":{"$error":"#REF!"}}]
[null,null,null,null,null,null,null,null,null,null,null,null,null,null,null,{"$f":"IF(#REF!=\"\",\"\",IF(#REF!<TODAY(),0,IF(#REF!<(TODAY()+365),1,\"X\")))","v":{"$error":"#REF!"}},{"$f":"IF(#REF!=\"\",\"\",\"X\")","v":{"$error":"#REF!"}}]
[null,null,null,null,null,null,null,null,null,null,null,null,null,null,null,{"$f":"IF(#REF!=\"\",\"\",IF(#REF!<TODAY(),0,IF(#REF!<(TODAY()+365),1,\"X\")))","v":{"$error":"#REF!"}},{"$f":"IF(#REF!=\"\",\"\",\"X\")","v":{"$error":"#REF!"}}]
[null,null,null,null,null,null,null,null,null,null,null,null,null,null,null,{"$f":"IF(#REF!=\"\",\"\",IF(#REF!<TODAY(),0,IF(#REF!<(TODAY()+365),1,\"X\")))","v":{"$error":"#REF!"}},{"$f":"IF(#REF!=\"\",\"\",\"X\")","v":{"$error":"#REF!"}}]
[null,null,null,null,null,null,null,null,null,null,null,null,null,null,null,{"$f":"IF(#REF!=\"\",\"\",IF(#REF!<TODAY(),0,IF(#REF!<(TODAY()+365),1,\"X\")))","v":{"$error":"#REF!"}},{"$f":"IF(#REF!=\"\",\"\",\"X\")","v":{"$error":"#REF!"}}]
[null,null,null,null,null,null,null,null,null,null,null,null,null,null,null,{"$f":"IF(#REF!=\"\",\"\",IF(#REF!<TODAY(),0,IF(#REF!<(TODAY()+365),1,\"X\")))","v":{"$error":"#REF!"}},{"$f":"IF(#REF!=\"\",\"\",\"X\")","v":{"$error":"#REF!"}}]
[null,null,null,null,null,null,null,null,null,null,null,null,null,null,null,{"$f":"IF(#REF!=\"\",\"\",IF(#REF!<TODAY(),0,IF(#REF!<(TODAY()+365),1,\"X\")))","v":{"$error":"#REF!"}},{"$f":"IF(#REF!=\"\",\"\",\"X\")","v":{"$error":"#REF!"}}]
[null,null,null,null,null,null,null,null,null,null,null,null,null,null,null,{"$f":"IF(#REF!=\"\",\"\",IF(#REF!<TODAY(),0,IF(#REF!<(TODAY()+365),1,\"X\")))","v":{"$error":"#REF!"}},{"$f":"IF(#REF!=\"\",\"\",\"X\")","v":{"$error":"#REF!"}}]
[null,null,null,null,null,null,null,null,null,null,null,null,null,null,null,{"$f":"IF(#REF!=\"\",\"\",IF(#REF!<TODAY(),0,IF(#REF!<(TODAY()+365),1,\"X\")))","v":{"$error":"#REF!"}},{"$f":"IF(#REF!=\"\",\"\",\"X\")","v":{"$error":"#REF!"}}]
[null,null,null,null,null,null,null,null,null,null,null,null,null,null,null,{"$f":"IF(#REF!=\"\",\"\",IF(#REF!<TODAY(),0,IF(#REF!<(TODAY()+365),1,\"X\")))","v":{"$error":"#REF!"}},{"$f":"IF(#REF!=\"\",\"\",\"X\")","v":{"$error":"#REF!"}}]
[null,null,null,null,null,null,null,null,null,null,null,null,null,null,null,{"$f":"IF(#REF!=\"\",\"\",IF(#REF!<TODAY(),0,IF(#REF!<(TODAY()+365),1,\"X\")))","v":{"$error":"#REF!"}},{"$f":"IF(#REF!=\"\",\"\",\"X\")","v":{"$error":"#REF!"}}]
[null,null,null,null,null,null,null,null,null,null,null,null,null,null,null,{"$f":"IF(#REF!=\"\",\"\",IF(#REF!<TODAY(),0,IF(#REF!<(TODAY()+365),1,\"X\")))","v":{"$error":"#REF!"}},{"$f":"IF(#REF!=\"\",\"\",\"X\")","v":{"$error":"#REF!"}}]
[null,null,null,null,null,null,null,null,null,null,null,null,null,null,null,{"$f":"IF(#REF!=\"\",\"\",IF(#REF!<TODAY(),0,IF(#REF!<(TODAY()+365),1,\"X\")))","v":{"$error":"#REF!"}},{"$f":"IF(#REF!=\"\",\"\",\"X\")","v":{"$error":"#REF!"}}]
[null,null,null,null,null,null,null,null,null,null,null,null,null,null,null,{"$f":"IF(#REF!=\"\",\"\",IF(#REF!<TODAY(),0,IF(#REF!<(TODAY()+365),1,\"X\")))","v":{"$error":"#REF!"}},{"$f":"IF(#REF!=\"\",\"\",\"X\")","v":{"$error":"#REF!"}}]
[null,null,null,null,null,null,null,null,null,null,null,null,null,null,null,{"$f":"IF(#REF!=\"\",\"\",IF(#REF!<TODAY(),0,IF(#REF!<(TODAY()+365),1,\"X\")))","v":{"$error":"#REF!"}},{"$f":"IF(#REF!=\"\",\"\",\"X\")","v":{"$error":"#REF!"}}]
[null,null,null,null,null,null,null,null,null,null,null,null,null,null,null,{"$f":"IF(#REF!=\"\",\"\",IF(#REF!<TODAY(),0,IF(#REF!<(TODAY()+365),1,\"X\")))","v":{"$error":"#REF!"}},{"$f":"IF(#REF!=\"\",\"\",\"X\")","v":{"$error":"#REF!"}}]
[null,null,null,null,null,null,null,null,null,null,null,null,null,null,null,{"$f":"IF(#REF!=\"\",\"\",IF(#REF!<TODAY(),0,IF(#REF!<(TODAY()+365),1,\"X\")))","v":{"$error":"#REF!"}},{"$f":"IF(#REF!=\"\",\"\",\"X\")","v":{"$error":"#REF!"}}]
[null,null,null,null,null,null,null,null,null,null,null,null,null,null,null,{"$f":"IF(#REF!=\"\",\"\",IF(#REF!<TODAY(),0,IF(#REF!<(TODAY()+365),1,\"X\")))","v":{"$error":"#REF!"}},{"$f":"IF(#REF!=\"\",\"\",\"X\")","v":{"$error":"#REF!"}}]
[null,null,null,null,null,null,null,null,null,null,null,null,null,null,null,{"$f":"IF(#REF!=\"\",\"\",IF(#REF!<TODAY(),0,IF(#REF!<(TODAY()+365),1,\"X\")))","v":{"$error":"#REF!"}},{"$f":"IF(#REF!=\"\",\"\",\"X\")","v":{"$error":"#REF!"}}]
[null,null,null,null,null,null,null,null,null,null,null,null,null,null,null,{"$f":"IF(#REF!=\"\",\"\",IF(#REF!<TODAY(),0,IF(#REF!<(TODAY()+365),1,\"X\")))","v":{"$error":"#REF!"}},{"$f":"IF(#REF!=\"\",\"\",\"X\")","v":{"$error":"#REF!"}}]
[null,null,null,null,null,null,null,null,null,null,null,null,null,null,null,{"$f":"IF(#REF!=\"\",\"\",IF(#REF!<TODAY(),0,IF(#REF!<(TODAY()+365),1,\"X\")))","v":{"$error":"#REF!"}},{"$f":"IF(#REF!=\"\",\"\",\"X\")","v":{"$error":"#REF!"}}]
[null,null,null,null,null,null,null,null,null,null,null,null,null,null,null,{"$f":"IF(#REF!=\"\",\"\",IF(#REF!<TODAY(),0,IF(#REF!<(TODAY()+365),1,\"X\")))","v":{"$error":"#REF!"}},{"$f":"IF(#REF!=\"\",\"\",\"X\")","v":{"$error":"#REF!"}}]
[null,null,null,null,null,null,null,null,null,null,null,null,null,null,null,{"$f":"IF(#REF!=\"\",\"\",IF(#REF!<TODAY(),0,IF(#REF!<(TODAY()+365),1,\"X\")))","v":{"$error":"#REF!"}},{"$f":"IF(#REF!=\"\",\"\",\"X\")","v":{"$error":"#REF!"}}]
[null,null,null,null,null,null,null,null,null,null,null,null,null,null,null,{"$f":"IF(#REF!=\"\",\"\",IF(#REF!<TODAY(),0,IF(#REF!<(TODAY()+365),1,\"X\")))","v":{"$error":"#REF!"}},{"$f":"IF(#REF!=\"\",\"\",\"X\")","v":{"$error":"#REF!"}}]
[null,null,null,null,null,null,null,null,null,null,null,null,null,null,null,{"$f":"IF(#REF!=\"\",\"\",IF(#REF!<TODAY(),0,IF(#REF!<(TODAY()+365),1,\"X\")))","v":{"$error":"#REF!"}},{"$f":"IF(#REF!=\"\",\"\",\"X\")","v":{"$error":"#REF!"}}]
[null,null,null,null,null,null,null,null,null,null,null,null,null,null,null,{"$f":"IF(#REF!=\"\",\"\",IF(#REF!<TODAY(),0,IF(#REF!<(TODAY()+365),1,\"X\")))","v":{"$error":"#REF!"}},{"$f":"IF(#REF!=\"\",\"\",\"X\")","v":{"$error":"#REF!"}}]
[null,null,null,null,null,null,null,null,null,null,null,null,null,null,null,{"$f":"IF(#REF!=\"\",\"\",IF(#REF!<TODAY(),0,IF(#REF!<(TODAY()+365),1,\"X\")))","v":{"$error":"#REF!"}},{"$f":"IF(#REF!=\"\",\"\",\"X\")","v":{"$error":"#REF!"}}]
[null,null,null,null,null,null,null,null,null,null,null,null,null,null,null,{"$f":"IF(#REF!=\"\",\"\",IF(#REF!<TODAY(),0,IF(#REF!<(TODAY()+365),1,\"X\")))","v":{"$error":"#REF!"}},{"$f":"IF(#REF!=\"\",\"\",\"X\")","v":{"$error":"#REF!"}}]
[null,null,null,null,null,null,null,null,null,null,null,null,null,null,null,{"$f":"IF(#REF!=\"\",\"\",IF(#REF!<TODAY(),0,IF(#REF!<(TODAY()+365),1,\"X\")))","v":{"$error":"#REF!"}},{"$f":"IF(#REF!=\"\",\"\",\"X\")","v":{"$error":"#REF!"}}]
[null,null,null,null,null,null,null,null,null,null,null,null,null,null,null,{"$f":"IF(#REF!=\"\",\"\",IF(#REF!<TODAY(),0,IF(#REF!<(TODAY()+365),1,\"X\")))","v":{"$error":"#REF!"}},{"$f":"IF(#REF!=\"\",\"\",\"X\")","v":{"$error":"#REF!"}}]
[null,null,null,null,null,null,null,null,null,null,null,null,null,null,null,{"$f":"IF(#REF!=\"\",\"\",IF(#REF!<TODAY(),0,IF(#REF!<(TODAY()+365),1,\"X\")))","v":{"$error":"#REF!"}},{"$f":"IF(#REF!=\"\",\"\",\"X\")","v":{"$error":"#REF!"}}]
[null,null,null,null,null,null,null,null,null,null,null,null,null,null,null,{"$f":"IF(#REF!=\"\",\"\",IF(#REF!<TODAY(),0,IF(#REF!<(TODAY()+365),1,\"X\")))","v":{"$error":"#REF!"}},{"$f":"IF(#REF!=\"\",\"\",\"X\")","v":{"$error":"#REF!"}}]
[null,null,null,null,null,null,null,null,null,null,null,null,null,null,null,{"$f":"IF(#REF!=\"\",\"\",IF(#REF!<TODAY(),0,IF(#REF!<(TODAY()+365),1,\"X\")))","v":{"$error":"#REF!"}},{"$f":"IF(#REF!=\"\",\"\",\"X\")","v":{"$error":"#REF!"}}]
[null,null,null,null,null,null,null,null,null,null,null,null,null,null,null,{"$f":"IF(#REF!=\"\",\"\",IF(#REF!<TODAY(),0,IF(#REF!<(TODAY()+365),1,\"X\")))","v":{"$error":"#REF!"}},{"$f":"IF(#REF!=\"\",\"\",\"X\")","v":{"$error":"#REF!"}}]
[null,null,null,null,null,null,null,null,null,null,null,null,null,null,null,{"$f":"IF(#REF!=\"\",\"\",IF(#REF!<TODAY(),0,IF(#REF!<(TODAY()+365),1,\"X\")))","v":{"$error":"#REF!"}},{"$f":"IF(#REF!=\"\",\"\",\"X\")","v":{"$error":"#REF!"}}]
[null,null,null,null,null,null,null,null,null,null,null,null,null,null,null,{"$f":"IF(#REF!=\"\",\"\",IF(#REF!<TODAY(),0,IF(#REF!<(TODAY()+365),1,\"X\")))","v":{"$error":"#REF!"}},{"$f":"IF(#REF!=\"\",\"\",\"X\")","v":{"$error":"#REF!"}}]
[null,null,null,null,null,null,null,null,null,null,null,null,null,null,null,{"$f":"IF(#REF!=\"\",\"\",IF(#REF!<TODAY(),0,IF(#REF!<(TODAY()+365),1,\"X\")))","v":{"$error":"#REF!"}},{"$f":"IF(#REF!=\"\",\"\",\"X\")","v":{"$error":"#REF!"}}]
[null,null,null,null,null,null,null,null,null,null,null,null,null,null,null,{"$f":"IF(#REF!=\"\",\"\",IF(#REF!<TODAY(),0,IF(#REF!<(TODAY()+365),1,\"X\")))","v":{"$error":"#REF!"}},{"$f":"IF(#REF!=\"\",\"\",\"X\")","v":{"$error":"#REF!"}}]
[null,null,null,null,null,null,null,null,null,null,null,null,null,null,null,{"$f":"IF(#REF!=\"\",\"\",IF(#REF!<TODAY(),0,IF(#REF!<(TODAY()+365),1,\"X\")))","v":{"$error":"#REF!"}},{"$f":"IF(#REF!=\"\",\"\",\"X\")","v":{"$error":"#REF!"}}]
[null,null,null,null,null,null,null,null,null,null,null,null,null,null,null,{"$f":"IF(#REF!=\"\",\"\",IF(#REF!<TODAY(),0,IF(#REF!<(TODAY()+365),1,\"X\")))","v":{"$error":"#REF!"}},{"$f":"IF(#REF!=\"\",\"\",\"X\")","v":{"$error":"#REF!"}}]
[null,null,null,null,null,null,null,null,null,null,null,null,null,null,null,{"$f":"IF(#REF!=\"\",\"\",IF(#REF!<TODAY(),0,IF(#REF!<(TODAY()+365),1,\"X\")))","v":{"$error":"#REF!"}},{"$f":"IF(#REF!=\"\",\"\",\"X\")","v":{"$error":"#REF!"}}]
[null,null,null,null,null,null,null,null,null,null,null,null,null,null,null,{"$f":"IF(#REF!=\"\",\"\",IF(#REF!<TODAY(),0,IF(#REF!<(TODAY()+365),1,\"X\")))","v":{"$error":"#REF!"}},{"$f":"IF(#REF!=\"\",\"\",\"X\")","v":{"$error":"#REF!"}}]
[null,null,null,null,null,null,null,null,null,null,null,null,null,null,null,{"$f":"IF(#REF!=\"\",\"\",IF(#REF!<TODAY(),0,IF(#REF!<(TODAY()+365),1,\"X\")))","v":{"$error":"#REF!"}},{"$f":"IF(#REF!=\"\",\"\",\"X\")","v":{"$error":"#REF!"}}]
[null,null,null,null,null,null,null,null,null,null,null,null,null,null,null,{"$f":"IF(#REF!=\"\",\"\",IF(#REF!<TODAY(),0,IF(#REF!<(TODAY()+365),1,\"X\")))","v":{"$error":"#REF!"}},{"$f":"IF(#REF!=\"\",\"\",\"X\")","v":{"$error":"#REF!"}}]
[null,null,null,null,null,null,null,null,null,null,null,null,null,null,null,{"$f":"IF(#REF!=\"\",\"\",IF(#REF!<TODAY(),0,IF(#REF!<(TODAY()+365),1,\"X\")))","v":{"$error":"#REF!"}},{"$f":"IF(#REF!=\"\",\"\",\"X\")","v":{"$error":"#REF!"}}]
[null,null,null,null,null,null,null,null,null,null,null,null,null,null,null,{"$f":"IF(#REF!=\"\",\"\",IF(#REF!<TODAY(),0,IF(#REF!<(TODAY()+365),1,\"X\")))","v":{"$error":"#REF!"}},{"$f":"IF(#REF!=\"\",\"\",\"X\")","v":{"$error":"#REF!"}}]
[null,null,null,null,null,null,null,null,null,null,null,null,null,null,null,{"$f":"IF(#REF!=\"\",\"\",IF(#REF!<TODAY(),0,IF(#REF!<(TODAY()+365),1,\"X\")))","v":{"$error":"#REF!"}},{"$f":"IF(#REF!=\"\",\"\",\"X\")","v":{"$error":"#REF!"}}]
[null,null,null,null,null,null,null,null,null,null,null,null,null,null,null,{"$f":"IF(#REF!=\"\",\"\",IF(#REF!<TODAY(),0,IF(#REF!<(TODAY()+365),1,\"X\")))","v":{"$error":"#REF!"}},{"$f":"IF(#REF!=\"\",\"\",\"X\")","v":{"$error":"#REF!"}}]
[null,null,null,null,null,null,null,null,null,null,null,null,null,null,null,{"$f":"IF(#REF!=\"\",\"\",IF(#REF!<TODAY(),0,IF(#REF!<(TODAY()+365),1,\"X\")))","v":{"$error":"#REF!"}},{"$f":"IF(#REF!=\"\",\"\",\"X\")","v":{"$error":"#REF!"}}]
[null,null,null,null,null,null,null,null,null,null,null,null,null,null,null,{"$f":"IF(#REF!=\"\",\"\",IF(#REF!<TODAY(),0,IF(#REF!<(TODAY()+365),1,\"X\")))","v":{"$error":"#REF!"}},{"$f":"IF(#REF!=\"\",\"\",\"X\")","v":{"$error":"#REF!"}}]
[null,null,null,null,null,null,null,null,null,null,null,null,null,null,null,{"$f":"IF(#REF!=\"\",\"\",IF(#REF!<TODAY(),0,IF(#REF!<(TODAY()+365),1,\"X\")))","v":{"$error":"#REF!"}},{"$f":"IF(#REF!=\"\",\"\",\"X\")","v":{"$error":"#REF!"}}]
[null,null,null,null,null,null,null,null,null,null,null,null,null,null,null,{"$f":"IF(#REF!=\"\",\"\",IF(#REF!<TODAY(),0,IF(#REF!<(TODAY()+365),1,\"X\")))","v":{"$error":"#REF!"}},{"$f":"IF(#REF!=\"\",\"\",\"X\")","v":{"$error":"#REF!"}}]
[null,null,null,null,null,null,null,null,null,null,null,null,null,null,null,{"$f":"IF(#REF!=\"\",\"\",IF(#REF!<TODAY(),0,IF(#REF!<(TODAY()+365),1,\"X\")))","v":{"$error":"#REF!"}},{"$f":"IF(#REF!=\"\",\"\",\"X\")","v":{"$error":"#REF!"}}]
[null,null,null,null,null,null,null,null,null,null,null,null,null,null,null,{"$f":"IF(#REF!=\"\",\"\",IF(#REF!<TODAY(),0,IF(#REF!<(TODAY()+365),1,\"X\")))","v":{"$error":"#REF!"}},{"$f":"IF(#REF!=\"\",\"\",\"X\")","v":{"$error":"#REF!"}}]
[null,null,null,null,null,null,null,null,null,null,null,null,null,null,null,{"$f":"IF(#REF!=\"\",\"\",IF(#REF!<TODAY(),0,IF(#REF!<(TODAY()+365),1,\"X\")))","v":{"$error":"#REF!"}},{"$f":"IF(#REF!=\"\",\"\",\"X\")","v":{"$error":"#REF!"}}]

{"sheet":"Synthèse de l'évaluation","index":4,"n_rows":88,"n_cols":7,"rows_kept":88,"cut":false,"hidden":false,"merged":[[82,5,82,6],[83,5,83,6],[86,5,86,6],[87,5,87,6],[82,0,82,3],[83,0,83,3],[85,0,85,3],[86,0,86,3],[87,0,87,3],[74,5,74,6],[74,0,75,3],[76,0,79,3],[76,5,76,6],[81,0,81,3],[71,0,72,3],[71,5,71,6],[73,0,73,3],[70,5,70,6],[66,0,66,3],[73,5,73,6],[67,5,67,6],[70,0,70,3],[67,0,67,3],[68,0,68,3],[65,5,65,6],[66,5,66,6],[68,5,68,6],[61,5,61,6],[63,5,63,6],[65,0,65,3],[19,5,19,6],[20,5,20,6],[21,5,21,6],[57,0,57,6],[55,2,55,6],[23,2,23,6],[62,0,62,3],[63,0,64,3],[0,4,0,6],[1,4,1,6],[51,2,51,6],[53,0,53,6],[37,0,37,1],[37,2,37,6],[39,0,39,1],[39,2,39,6],[12,5,12,6],[13,5,13,6],[14,5,14,6],[15,5,15,6],[16,5,16,6],[17,5,17,6],[18,5,18,6]]}
[null,null,null,null,"Date of entry"]
[null,"Underground  environments",null,null,"2025-10-24T10:31:16"]
[]
[null,"Mission Organisation"]
["Working place",{"$f":"'Mission assessment'!J5","v":"moye"}]
["Nature of the mission",{"$f":"'Mission assessment'!H5","v":"carottage  spéléothème"}]
["Mission start date",{"$f":"'Mission assessment'!F7","v":"00:00:00"}]
["Mission end date",{"$f":"'Mission assessment'!G5","v":"2025-10-30"}]
[]
["Cavity type :",{"$f":"'Mission assessment'!A5","v":1}]
[null,"Team composition"]
[]
[{"$f":"'Mission assessment'!C5:C14","v":"toto"},{"$f":"'Mission assessment'!D5:D14","v":"Graduate Class 0, 1, 2, 3, and 4"},null,null,null,{"$f":"VLOOKUP('Mission assessment'!B5,Tableau2[],2,FALSE)","v":"COS"}]
["tutu","Recognised 0, 1 and 2 ",null,null,null,{"$f":"VLOOKUP('Mission assessment'!B6,Tableau2[],2,FALSE)","v":"OS"}]
["titi","Recognised 0, 1, 2 and 3 ",null,null,null,{"$f":"VLOOKUP('Mission assessment'!B7,Tableau2[],2,FALSE)","v":"OS"}]
["tata","Graduate Class 0, 1, and 2",null,null,null,{"$f":"VLOOKUP('Mission assessment'!B8,Tableau2[],2,FALSE)","v":"OS"}]
[0,0,null,null,null,{"$f":"VLOOKUP('Mission assessment'!B9,Tableau2[],2,FALSE)","v":{"$error":"#N/A"}}]
[0,0,null,null,null,{"$f":"VLOOKUP('Mission assessment'!B10,Tableau2[],2,FALSE)","v":{"$error":"#N/A"}}]
[0,0,null,null,null,{"$f":"VLOOKUP('Mission assessment'!B11,Tableau2[],2,FALSE)","v":{"$error":"#N/A"}}]
[0,0,null,null,null,{"$f":"VLOOKUP('Mission assessment'!B12,Tableau2[],2,FALSE)","v":{"$error":"#N/A"}}]
[0,0,null,null,null,{"$f":"VLOOKUP('Mission assessment'!B13,Tableau2[],2,FALSE)","v":{"$error":"#N/A"}}]
[0,0,null,null,null,{"$f":"VLOOKUP('Mission assessment'!B14,Tableau2[],2,FALSE)","v":{"$error":"#N/A"}}]
[]
[null,null,"Licence/training"]
[null,null,"B","C","E(B)","SST","SST Hostile environments"]
["Responsable mission",{"$f":"'Mission assessment'!C5","v":"toto"},{"$f":"'Mission assessment'!L5:N14","v":"No longer valid"},"No longer valid","No longer valid",{"$f":"'Mission assessment'!P5:Q14","v":"No longer valid"},"No longer valid"]
[{"$f":"'Mission assessment'!B6:C14","v":"Underground Operator"},"tutu","Yes",0,0,0,0]
["Underground Operator","titi",0,0,"No","Yes",0]
["Underground Operator","tata","Yes",0,0,0,"No"]
[0,0,0,0,0,0,0]
[0,0,0,0,0,0,0]
[0,0,0,0,0,0,0]
[0,0,0,0,0,0,0]
[0,0,0,0,0,0,0]
[0,0,0,0,0,0,0]
[]
[]
["Risk level before application of the head of mission's obligations (0 à 100)",null,{"$f":"'Mission assessment'!AI10","v":18}]
[]
["Risk level after application of the head of mission's obligations",null,{"$f":"'Mission assessment'!AI16","v":2}]
[]
[]
[]
[]
[]
[]
[]
[]
[]
[]
[]
[null,"Organisational instructions"]
[]
[{"$f":"VLOOKUP('Mission assessment'!A5,'organisational and technical in'!A4:B8,2,FALSE)","v":"Mission order. Working alone is prohibited; however, an agent may, in exceptional circumstances, enter a class 0 or 1 cavity alone, provided that the necessary safety precautions have been taken. To do so, they must have informed the DU, the AP and the person in charge of underground activities of the precise location of the site, the cave or section of cave, the alert procedures, the planned entry and exit times, and their actual exit time. + At least one competent person with technical skills appropriate to the terrain."}]
[]
[null,"Technical Instructions"]
[]
[{"$f":"VLOOKUP('Mission assessment'!A5,'organisational and technical in'!A12:B16,2,FALSE)","v":"First aid kit + Helmet with light and double lighting for working alone. "}]
[]
[null,"Obligations"]
[]
[null,null,null,null,null,"Results"]
[{"$f":"'Mission assessment'!AD2","v":"Obligations of the head of mission prior to departure "}]
[{"$f":"'Mission assessment'!AD3","v":"Specific information about the mission was provided: instructions each day before departure (each person's role and mission, etc.)."},null,null,null,null,{"$f":"'Mission assessment'!AD6","v":"Yes"}]
[]
[{"$f":"'Mission assessment'!AE3","v":"Checking that participants' equipment and PPE are in good condition."},null,null,null,null,{"$f":"'Mission assessment'!AE6","v":"Yes"}]
[{"$f":"'Mission assessment'!AF3","v":"Check the compatibility of staff fatigue with the mission every day"},null,null,null,null,{"$f":"'Mission assessment'!AF6","v":"Yes"}]
[{"$f":"'Mission assessment'!AG3","v":"Checking weather and hydrological reports"},null,null,null,null,{"$f":"'Mission assessment'!AG6","v":"Yes"}]
[{"$f":"'Mission assessment'!AH3","v":"Field first aid kit"},null,null,null,null,{"$f":"'Mission assessment'!AH6","v":"No"}]
[]
[{"$f":"'Mission assessment'!AI2","v":"Obligations of the head of mission during the missionn"}]
[{"$f":"'Mission assessment'!AI3","v":"He undertakes to check the equipment during the mission and to modify it or the mission if necessary."},null,null,null,null,{"$f":"'Mission assessment'!AI6","v":"No"}]
[]
[{"$f":"'Mission assessment'!AJ3","v":"Ensures safety at all times"},null,null,null,null,{"$f":"'Mission assessment'!AJ6","v":"Yes"}]
["S’engage à arrêter la mission, à revenir dans un lieu sécurisé, ou à mettre en place une procédure d’urgence. Il a la seule autorité pour ces choix.",null,null,null,null,{"$f":"'Mission assessment'!AK6","v":"No"}]
[]
[{"$f":"'Mission assessment'!AL3","v":"In the event of an accident, undertakes to attend to the victim and raise the alarm. Immediately alerts the DU and AP. He submits a detailed report to the DU upon his return from the mission."},null,null,null,null,{"$f":"'Mission assessment'!AL6","v":"No"}]
[]
[]
[]
[]
[{"$f":"'Mission assessment'!AM2","v":"Intervention by personnel from outside the laboratory"}]
[{"$f":"'Mission assessment'!AM3","v":"Working together: an agreement has been signed"},null,null,null,null,{"$f":"'Mission assessment'!AM6","v":"Not applicable"}]
[{"$f":"'Mission assessment'!AN3","v":"Concurrent works: has a prevention plan been signed?"},null,null,null,null,{"$f":"'Mission assessment'!AN6","v":"Not applicable"}]
[]
[{"$f":"'Mission assessment'!AO2","v":"Incidents / Accidents"}]
[{"$f":"'Mission assessment'!AO3","v":"The members of the group are first-aiders."},null,null,null,null,{"$f":"'Mission assessment'!AO6","v":"No"}]
[{"$f":"'Mission assessment'!AP3","v":"For missions outside the EU: Ensure that rescue resources are available."},null,null,null,null,{"$f":"'Mission assessment'!AP6","v":"Not applicable"}]